{"text_format":"1","workbook":"xlsx","n_sheets":17,"sheets":["Info","Ex","ST-1-1","ST-1-2","ST-1-3","ST-1-4","ST-1-5","ST-0-1","ST-0-2","ST-0-3","ST-0-4","ST-0-5","STM-1-1","STM-1-2","STM-0-1","STM-0-2","Rep"],"not_rendered":{"charts":0,"images":2,"macros":1,"external_links":0,"defined_names":17,"comments":0,"pivot_tables":0},"unopened":[],"bounds":{"document_bytes":16777216,"sheet_cells":100000,"rows_first":2000,"rows_last":500,"rows_between":2000,"halvings":0,"cell_chars":16384,"cell_head_chars":4096},"cells_cut":0,"cells_raw":0,"read":"whole","date_system":"1900"}

{"sheet":"Info","index":0,"n_rows":95,"n_cols":13,"rows_kept":95,"cut":false,"hidden":false,"merged":[[69,12,70,14],[71,2,71,5],[71,0,94,0],[65,0,70,0],[66,6,70,11],[70,3,70,5],[69,3,69,5],[68,3,68,5],[67,3,67,5],[66,3,66,5],[65,1,65,14],[66,12,66,14],[67,12,68,14]]}
["1.","Arkusz przeznaczony jest dla :",null,null,null,null,"Okręgu PZHGP ","TORUŃ"]
[null,"BARDZO WAŻNE ! - Skoroszyt dostarczony w tej formie i nazwie powinien zostać po wypełnieniu oddany w tej samej formie i nazwie. "]
[null,"PROSZĘ - nie kopiować skoroszytu, nie zmieniać jego nazwy (jest to istotne do dalszego działania makr)."]
[null,"Pomimo zabezpieczenia w niektórych elementach skoroszytu możliwe są częściowe zmiany, np. formatu lub czcionki, "]
[null,"jednakże BARDZO PROSZĘ tego nie robić !!!"]
["2.","Automatyczne wczytywanie danych utworzonych programem oddziałowym Andrzeja Wojtasioka w wersji min. 07-2020"]
[null,"2.1.","Przed uruchomieniem przycisku \"CZYTAJ DANE ...\" należy upewnić się, czy w tym samym folderze co ten skoroszyt Excela"]
[null,null,"zapisane są pliki tekstowe : ST-1-1.txt do ST-1-5.txt, ST-0-1.txt do ST-0-5.txt, STM-1-1.txt i STM-1-2.txt, STM-0-1.txt i STM-0-2.txt"]
[null,null,"(makro umożliwia nawet częściowe czytanie danych z plików tekstowych - dlatego nie musi być kompletu ww. plików - część "]
[null,null,"może być sczytana automatycznie, a część dopisana ręcznie, np. barwa, wg kolejnego punktu 3.)."]
[null,"2.2.","Uruchomić (kliknąć) przycisk \"CZYTAJ DANE …\" (obok z prawej strony), UWAGA ! - przycisk ten przed wczytaniem danych czyści wszystkie wpisy."]
[null,null,"Po wczytaniu danych aktywną komórką staje się A17:A18 (do wpisania, poprawy Nazwiska Hodowcy)."]
[null,"2.3.","Sprawdzić wczytane dane w poszczególnych arkuszach (zwrócić uwagę na kolory wypełnień opisane poniżej)."]
[null,null,"Sprawdzić także należy prawidłowość wypełnienia opisanego z pkt 3. (np. sposób wpisywania Imienia i nazwiska hodowcy)."]
[null,null,"UWAGA ! - Jeżeli barwy w plikach tekstowych różnią się od zapisanych w tabeli \"G73:G95\" to rubryka barwa pozostaje pusta i należy ją uzupełnić."]
[null,"2.4.","Proszę pamiętać, że uruchomienie przycisku powoduje najpierw WYCZYSZCZENIE arkuszy do których są wczytywane pliki tekstowe,"]
[null,null,"a dopiero potem wczytanie danych z istniejących plików tekstowych (brak pliku sygnalizowany jest komunikatem)."]
["3.","W przypadku braku plików tekstowych (pkt.2.1.) wypełnić należy WSZYSTKIE komórki w kolorze tła jak ten."]
[null,"UWAGA ! - Przed wypełnianiem dobrze byłoby uruchomić CZYSZCZENIE (przycisk obok z prawej strony) jednak należy zwrócić uwagę"]
[null,"na to, że jeśli uprzednio korzystało się z Automatycznego wczytania (pkt 2) to CZYSZCZENIE usunie te wpisy - więc dobrze byłoby "]
[null,"uruchomić CZYSZCZENIE na samym początku, przed przystąpieniem czy to do Automatycznego wczytania, czy do ręcznego wypełniania."]
[null,"Po wyczyszczeniu komórek aktywną komórką staje się A17:A18 (do wpisania Nazwiska Hodowcy)."]
[null,"W trakcie wpisywania komórki mogą zmieniać kolor (opis w dalszej części)  - przykład wypełnienia w arkuszu \"Ex\""]
[null,"Komórki w kolorze tła innym niż ten, są zabezpieczone i nie mogą być wypełniane żadną informacją."]
[null,null,"komórki","- wypełnienie :"]
[null,"3.1.","A17 : A18","- Imię i Nazwisko Hodowcy wpisać w scalonych komórkach A17:A18"]
[null,null,null,null,"Najpierw należy wpisać Imię z dużej litery (pozostałe małe), a następnie nazwisko całe dużymi literami."]
[null,null,null,null,"W przypadku tandemów wpisać obydwa nazwiska dużymi literami przedzielone kreską."]
[null,null,null,null,"Przypisy : \"bracia\", \"syn\", \"synowie\", \"ojciec\" itd. należy pisać na końcu małymi literami."]
[null,"3.2.","A21 : A22","- Oddział PZHGP wpisac dużymi literami - max. 15 znaków"]
[null,"3.3.","E1 : G1","- Obrączkę Rodową gołębia należy wpisać w formacie :"]
[null,null,null,null,"Państwo - Oddział - rocznik - nr kolejny, np. PL-0123-01-1234"]
[null,"3.4.","E2 : G2","- Barwę - należy wybrać z tabeli wyboru."]
[null,"3.5.","H1","- Płeć - jest wpisana 1-samczy lub 0-samiczka w zależności dla jakiej płci jest przeznaczony arkusz (dlatego kolor niebieski)"]
[null,"3.6.","C6 : Cx","- Datę lotu - wpisać należy w formacie rr-mm-dd : "]
[null,null,null,null,"r","- rok : jedna lub 2 cyfry (od 0 do 10), np. 10 oznacza rok 2010, a 9 - 2009, następnie kreska"]
[null,null,null,null,"m","- miesiąc : jedna lub 2 cyfry (od 1 do 12), np. 5 oznacza maj, następnie kreska "]
[null,null,null,null,"d","- dzień : jedna lub 2 cyfry (od 1 do 31), np. 25"]
[null,null,null,null,"Arkusz sprawdza czy wpisana data mieści się w przedziale dopuszczalnych dat i jest prawidłowo (zgodnie z formatem) wpisana :"]
[null,null,null,null,"PRAWIDŁOWY WPIS"]
[null,null,null,null,"WPIS NIE MIEŚCI SIĘ W PRZEDZIALE (lub zły format daty)"]
[null,"3.7.","D6 : Dx","- Poszczególne miejscowości wypuszczenia - wpisać dużymi literami - max. 15 znaków"]
[null,"3.8.","E6 : Ex","- Odległość z lotu \"km\" należy podać w postaci liczby całkowitej lub rzeczywistej "]
[null,null,null,null,"zaokrąglonej do 2 miejsc po przecinku."]
[null,null,null,null,"Arkusz sprawdza czy wpisana odległość mieści się w przedziale danej klasy i po wpisaniu :"]
[null,null,null,null,"zamienia kolor komórki na :"]
[null,null,null,null,"PRAWIDŁOWY WPIS"]
[null,null,null,null,"WPIS NIE MIEŚCI SIĘ W PRZEDZIALE"]
[null,"3.9.","F6 : Fx","- Ilość włożonych na lot gołębi - arkusz sprawdza prawidłowość wpisu i oznacza kolorem j.w."]
[null,null,null,null,"Wpis sprawdzany jest na minimum włożonych gołębi w danej klasie"]
[null,"3.10.","G6 : Gx","- Nr konkursu - arkusz sprawdza prawidłowość wpisu i oznacza kolorem j.w."]
[null,null,null,null,"Sprawdza się czy liczba zawarta jest pomiędzy 1, a ilością konkursów na bazie 20%"]
[null,"3.11.","H6 : Hx","- Ilość hodowców biorących udział w locie - arkusz sprawdza prawidłowość wpisu i oznacza kolorem j.w."]
[null,null,null,null,"Wpis sprawdzany jest na minimum hodowców biorących udział w locie w danej klasie"]
["4.","Komórki w kolorze tła jak ten, same obliczają wynik lub są zapisane gotową informacją."]
[null,"a w przypadku podsumowania Konk.-km zmieniają kolor tła na : "]
[null,null,"WYNIK PRAWIDŁOWY"]
[null,null,"WYNIK NIEKOMPLETNY LUB ZŁY"]
["5.","Skoroszyt składa się z: arkusza \"Info\", \"Ex\" (przykład), po 5 arkuszy z każdej Klasy Standard : 1-samczyki i 0-samiczki oraz po 2 arkusze Klasy Standard Młode : "]
[null,"1-samczyki i 0-samiczki. Na końcu znajduje się arkusz \"Rep\" - zbiorcze zestawienia Okręgu, który zostaje wypełniony automatycznie."]
[null,"W przypadku niepełnej reprezentacji Okręgu należy zacząć od wypełniania arkuszy z numerem 1, dalej 2 i na końcu 5 jeśli jest komplet w danej klasie."]
[]
[null,null,"Życzę bezproblemowej pracy",null,null,null,null,null,"UWAGA !!! - w razie problemów ze skoroszytem lub wątpliwościami co do wypełnienia"]
[null,null,"Dobry Lot !",null,null,null,null,null,"bardzo proszę kontaktować się drogą mailową : katgol@pro.onet.pl, "]
[null,null,"Andrzej Wojtasiok",null,null,null,null,null,"a nie telefonicznie !"]
[]
[null,"nr dnia","data","legenda",null,null," - daty od/do kiedy mogą być wpisywane daty lotów\n   (wystarczy poprawić \"datę\", a nr dnia zmieni się sam)\n\nUWAGA ! - ZE WZGLĘDU na ochronę kontroli prawidłowych wpisów zmiany te nie są na tym etapie dostępne !",null,null,null,null,null,"wpisać rok :"]
[null,{"$f":"C68","v":43936},"2020-04-15","od ub. rok",null,null,null,null,null,null,null,null,"Kkm za 2020 rok "]
[null,{"$f":"C69","v":44104},"2020-09-30","do ub. rok"]
[null,{"$f":"C70","v":44301},"2021-04-15","od b. rok",null,null,null,null,null,null,null,null,"Kkm za 2021 rok "]
[null,{"$f":"C71","v":44469},"2021-09-30","do b. rok"]
["BARWY GOŁĘBI wg zalecenia ZG PZHGP :",null,"Barwa w arkuszu xls",null,null,null,"Barwa w DOS"]
[null,1,"niebieska",null,null,null,"niebies."]
[null,2,"niebiesko-nakr.",null,null,null,"n-nakrap"]
[null,3,"ciemno-nakrap.",null,null,null,"c-nakrap"]
[null,4,"ciemna",null,null,null,"ciemna"]
[null,5,"czarna",null,null,null,"czarna"]
[null,6,"czerwono-nakr.",null,null,null,"czer-nak"]
[null,7,"czerwona",null,null,null,"czerwona"]
[null,8,"płowa",null,null,null,"płowa"]
[null,9,"biała",null,null,null,"biała"]
[null,10,"szpakowata",null,null,null,"szpak"]
[null,11,"niebiesko-pstra",null,null,null,"n-pstra"]
[null,12,"nieb-nakr-pstra",null,null,null,"n-n-pst."]
[null,13,"ciem-nakr-pstra",null,null,null,"c-n-pst."]
[null,14,"ciemno-pstra",null,null,null,"c-pstra"]
[null,15,"czarno-pstra",null,null,null,"czar-pst"]
[null,16,"czer-nakr-pstra",null,null,null,"czer-n-p"]
[null,17,"czerwono-pstra",null,null,null,"czer-pst"]
[null,18,"płowo-pstra",null,null,null,"pł-pstra"]
[null,19,"szpak-pstra",null,null,null,"szp-pst."]
[null,20,"czerwono-szpak",null,null,null,"czer-szp"]
[null,21,"czer-szp-pstra",null,null,null,"czer-s-p"]
[null,22,"płowo-szpak",null,null,null,"pł-szp."]
[null,23,"pł-szpak-pstra",null,null,null,"pł-szp-p"]

{"sheet":"Ex","index":1,"n_rows":27,"n_cols":14,"rows_kept":27,"cut":false,"hidden":false,"merged":[[14,0,15,0],[2,3,2,7],[2,1,2,2],[1,4,1,6],[0,1,1,2],[0,4,0,6],[0,0,3,0],[25,5,25,7],[26,5,26,6],[25,1,25,3],[18,0,19,0],[16,0,17,0],[20,0,21,0],[23,0,24,0],[26,1,26,3]]}
["70. OGÓLNOPOLSKA\nWYSTAWA\nGOŁĘBI POCZTOWYCH",null,null,"Obrączka Rodowa","PL-0123-01-12345",null,null,1,1,{"$f":"Info!C73","v":"niebieska"}]
[null,null,null,"Barwa","niebieska",null,null,"Płeć",2,{"$f":"Info!C74","v":"niebiesko-nakr."},null,null,{"$f":"Info!B68","v":43936},"od ubr"]
[null,"Nr Klatki ",null,"Zestawienie lotów",null,null,null,null,3,{"$f":"Info!C75","v":"ciemno-nakrap."},null,null,{"$f":"Info!B69","v":44104},"do ubr"]
[null,"Lp.","Data lotu","Miejscowość wypuszczenia","km","Włoż. Goł.\nNa lot","Nr \nkonkursu","Ilość Hodowców",4,{"$f":"Info!C76","v":"ciemna"},null,null,{"$f":"Info!B70","v":44301},"od br"]
[null,"XX","wpisz : r-m-d","max. 15 znaków","pow. 100","min. 250","max. Kol. F/5","min. 20",5,{"$f":"Info!C77","v":"czarna"},null,null,{"$f":"Info!B71","v":44469},"do br"]
[null,"1.",{"$f":"Info!C68+28","v":"2020-05-13"},"OŁAWA       (s)        ",137.44,5333,2,132,6,{"$f":"Info!C78","v":"czerwono-nakr."},null,{"$f":"IF(AND(C6>=$M$2,C6<=$M$3,E6>=100,E6<=1500,F6>=150,H6>=20),E6,0)","v":137.44},{"$f":"IF(AND(C6>=$M$4,C6<=$M$5,E6>=100,E6<=1500,F6>=150,H6>=20),E6,0)","v":0}]
[null,"2.",{"$f":"Info!C68+35","v":"2020-05-20"},"POZNAŃ              ",290.95,5034,930,135,7,{"$f":"Info!C79","v":"czerwona"},null,{"$f":"IF(AND(C7>=$M$2,C7<=$M$3,E7>=100,E7<=1500,F7>=150,H7>=20),E7,0)","v":290.95},{"$f":"IF(AND(C7>=$M$4,C7<=$M$5,E7>=100,E7<=1500,F7>=150,H7>=20),E7,0)","v":0}]
[null,"3.",{"$f":"Info!C68+56","v":"2020-06-10"},"SŁUBICE 1           ",383.24,4537,55,131,8,{"$f":"Info!C80","v":"płowa"},null,383.24,0]
[null,"4.",{"$f":"Info!C68+63","v":"2020-06-17"},"PERLEBERG           ",576.80999999999995,2683,154,125,9,{"$f":"Info!C81","v":"biała"},null,576.80999999999995,0]
[null,"5.",{"$f":"Info!C68+70","v":"2020-06-24"},"PERLEBERG 2         ",576.80999999999995,1785,37,109,10,{"$f":"Info!C82","v":"szpakowata"},null,576.80999999999995,0]
[null,"6.",{"$f":"Info!C68+84","v":"2020-07-08"},"PAPENBURG 1 (o)",853.9,3356,35,423,11,{"$f":"Info!C83","v":"niebiesko-pstra"},null,853.9,0]
["MIĘDZYNARODOWE CENTRUM","7.",{"$f":"Info!C68+98","v":"2020-07-22"},"PAPENBURG 2 (o)",853.9,3169,623,389,12,{"$f":"Info!C84","v":"nieb-nakr-pstra"},null,853.9,0]
["KONGRESOWE w Katowicach","8.",{"$f":"Info!C70+35","v":"2021-05-20"},"ŚRODA ŚL.           ",190.11,5185,300,126,13,{"$f":"Info!C85","v":"ciem-nakr-pstra"},null,0,190.11]
["07-09 stycznia 2022 roku","9.",{"$f":"Info!C70+70","v":"2021-06-24"},"POZNAŃ              ",290.88,5121,24,129,14,{"$f":"Info!C86","v":"ciemno-pstra"},null,0,290.88]
["Imię i NAZWISKO Hodowcy","10.",{"$f":"Info!C70+77","v":"2021-07-01"},"GORZÓW WLKP.        ",381.88,4342,83,125,15,{"$f":"Info!C87","v":"czarno-pstra"},null,0,381.88]
[null,"11.",{"$f":"Info!C70+91","v":"2021-07-15"},"PYRZYCE             ",431.27,4095,758,124,16,{"$f":"Info!C88","v":"czer-nakr-pstra"},null,0,431.27]
["Andrzej WOJTASIOK","12.",{"$f":"Info!C70+105","v":"2021-07-29"},"SKWIERZYNA          ",358.96,2888,283,117,17,{"$f":"Info!C89","v":"czerwono-pstra"},null,0,358.96]
[null,"13.",null,null,null,null,null,null,18,{"$f":"Info!C90","v":"płowo-pstra"},null,0,0]
[" Oddział PZHGP","14.",null,null,null,null,null,null,19,{"$f":"Info!C91","v":"szpak-pstra"},null,0,0]
[null,"15.",null,null,null,null,null,null,20,{"$f":"Info!C92","v":"czerwono-szpak"},null,0,0]
["ŻORY","16.",null,null,null,null,null,null,21,{"$f":"Info!C93","v":"czer-szp-pstra"},null,0,0]
[null,"17.",null,null,null,null,null,null,22,{"$f":"Info!C94","v":"płowo-szpak"},null,0,0]
[" Okręg PZHGP","18.",null,null,null,null,null,null,23,{"$f":"Info!C95","v":"pł-szpak-pstra"},null,0,0]
["KATOWICE","19.",null,null,null,null,null,null,null,null,null,0,0]
[null,"20.",null,null,null,null,null,null,null,null,null,0,0]
["Kategoria wystawowa",{"$f":"Info!M68","v":"Kkm za 2020 rok "},null,null,{"$f":"SUM(L6:L25)","v":3673.05},"Razem kkm :"]
["STANDARD - Samczyki (1/0)",{"$f":"Info!M70","v":"Kkm za 2021 rok "},null,null,{"$f":"IF(OR(SUM(M6:M25)>=750,SUM(M6:M25)=0),SUM(M6:M25),\"MAŁO\")","v":1653.1},{"$f":"IF(AND(E27<>\"MAŁO\",OR(SUM(L6:M25)>=2500,SUM(L6:M25)=0)),SUM(L6:M25),\"MAŁO\")","v":5326.1500000000005},null,"kkm"]

{"sheet":"ST-1-1","index":2,"n_rows":27,"n_cols":14,"rows_kept":27,"cut":false,"hidden":false,"merged":[[26,1,26,3],[25,5,25,7],[26,5,26,6],[25,1,25,3],[18,0,19,0],[20,0,21,0],[23,0,24,0],[14,0,15,0],[2,3,2,7],[2,1,2,2],[1,4,1,6],[0,1,1,2],[0,4,0,6],[0,0,3,0],[16,0,17,0]]}
[{"$f":"Ex!A1","v":"70. OGÓLNOPOLSKA\nWYSTAWA\nGOŁĘBI POCZTOWYCH"},{"$f":"Rep!A5","v":0},null,"Obrączka Rodowa","PL-0326-20-9441",null,null,1,1,{"$f":"Info!C73","v":"niebieska"}]
[null,null,null,"Barwa","niebiesko-nakr.",null,null,"Płeć",2,{"$f":"Info!C74","v":"niebiesko-nakr."},null,null,{"$f":"Info!B68","v":43936},"od ubr"]
[null,"Nr Klatki ",null,"Zestawienie lotów",null,null,null,null,3,{"$f":"Info!C75","v":"ciemno-nakrap."},null,null,{"$f":"Info!B69","v":44104},"do ubr"]
[null,"Lp.","Data lotu","Miejscowość wypuszczenia","km","Włoż. Goł.\nNa lot","Nr \nkonkursu","Ilość Hodowców",4,{"$f":"Info!C76","v":"ciemna"},null,null,{"$f":"Info!B70","v":44301},"od br"]
[null,"XX","wpisz : r-m-d","max. 15 znaków","min. 100 -5%","min. 150","max. Kol. F/5","min. 20",5,{"$f":"Info!C77","v":"czarna"},null,null,{"$f":"Info!B71","v":44469},"do br"]
[null,"1.","2021-05-24","WAŁCZ",159.75,7473,905,133,6,{"$f":"Info!C78","v":"czerwono-nakr."},null,{"$f":"IF(AND(C6>=$M$2,C6<=$M$3,E6>=95,E6<=2000,F6>=150,H6>=20),E6,0)","v":0},{"$f":"IF(AND(C6>=$M$4,C6<=$M$5,E6>=95,E6<=2000,F6>=150,H6>=20),E6,0)","v":159.75}]
[null,"2.","2021-05-30","KALISZ POMORSKI",196.49,7499,617,144,7,{"$f":"Info!C79","v":"czerwona"},null,{"$f":"IF(AND(C7>=$M$2,C7<=$M$3,E7>=95,E7<=2000,F7>=150,H7>=20),E7,0)","v":0},{"$f":"IF(AND(C7>=$M$4,C7<=$M$5,E7>=95,E7<=2000,F7>=150,H7>=20),E7,0)","v":196.49}]
[null,"3.","2021-06-06","PASEWALK 1",325.29000000000002,6970,438,141,8,{"$f":"Info!C80","v":"płowa"},null,0,325.29000000000002]
[null,"4.","2021-06-27","UELZEN 1",553.58000000000004,4277,683,125,9,{"$f":"Info!C81","v":"biała"},null,0,553.58000000000004]
[null,"5.","2021-07-04","UELZEN 2",553.58000000000004,3434,369,111,10,{"$f":"Info!C82","v":"szpakowata"},null,0,553.58000000000004]
[null,"6.","2021-07-10","SOGEL 1",759.84,1993,10,93,11,{"$f":"Info!C83","v":"niebiesko-pstra"},null,0,759.84]
[{"$f":"Ex!A12","v":"MIĘDZYNARODOWE CENTRUM"},"7.",null,null,null,null,null,null,12,{"$f":"Info!C84","v":"nieb-nakr-pstra"},null,0,0]
[{"$f":"Ex!A13","v":"KONGRESOWE w Katowicach"},"8.",null,null,null,null,null,null,13,{"$f":"Info!C85","v":"ciem-nakr-pstra"},null,0,0]
[{"$f":"Ex!A14","v":"07-09 stycznia 2022 roku"},"9.",null,null,null,null,null,null,14,{"$f":"Info!C86","v":"ciemno-pstra"},null,0,0]
["Imię i NAZWISKO Hodowcy","10.",null,null,null,null,null,null,15,{"$f":"Info!C87","v":"czarno-pstra"},null,0,0]
[null,"11.",null,null,null,null,null,null,16,{"$f":"Info!C88","v":"czer-nakr-pstra"},null,0,0]
["Maciej KACZMAREK","12.",null,null,null,null,null,null,17,{"$f":"Info!C89","v":"czerwono-pstra"},null,0,0]
[null,"13.",null,null,null,null,null,null,18,{"$f":"Info!C90","v":"płowo-pstra"},null,0,0]
[" Oddział PZHGP","14.",null,null,null,null,null,null,19,{"$f":"Info!C91","v":"szpak-pstra"},null,0,0]
[null,"15.",null,null,null,null,null,null,20,{"$f":"Info!C92","v":"czerwono-szpak"},null,0,0]
["TORUŃ","16.",null,null,null,null,null,null,21,{"$f":"Info!C93","v":"czer-szp-pstra"},null,0,0]
[null,"17.",null,null,null,null,null,null,22,{"$f":"Info!C94","v":"płowo-szpak"},null,0,0]
[" Okręg PZHGP","18.",null,null,null,null,null,null,23,{"$f":"Info!C95","v":"pł-szpak-pstra"},null,0,0]
[{"$f":"Info!H1","v":"TORUŃ"},"19.",null,null,null,null,null,null,null,null,null,0,0]
[null,"20.",null,null,null,null,null,null,null,null,null,0,0]
["Kategoria wystawowa",{"$f":"Ex!B26","v":"Kkm za 2020 rok "},null,null,{"$f":"SUM(L6:L25)","v":0},"Razem kkm :"]
["STANDARD - Samczyki (1/0)",{"$f":"Ex!B27","v":"Kkm za 2021 rok "},null,null,{"$f":"IF(OR(SUM(M6:M25)>750,SUM(M6:M25)=0),SUM(M6:M25),\"MAŁO\")","v":2548.5300000000002},{"$f":"IF(AND(E27<>\"MAŁO\",OR(SUM(L6:M25)>=2500,SUM(L6:M25)=0)),SUM(L6:M25),\"MAŁO\")","v":2548.5300000000002},null,"kkm"]

{"sheet":"ST-1-2","index":3,"n_rows":27,"n_cols":14,"rows_kept":27,"cut":false,"hidden":false,"merged":[[25,5,25,7],[26,1,26,3],[26,5,26,6],[14,0,15,0],[16,0,17,0],[18,0,19,0],[20,0,21,0],[23,0,24,0],[25,1,25,3],[0,0,3,0],[0,1,1,2],[0,4,0,6],[1,4,1,6],[2,1,2,2],[2,3,2,7]]}
[{"$f":"Ex!A1","v":"70. OGÓLNOPOLSKA\nWYSTAWA\nGOŁĘBI POCZTOWYCH"},{"$f":"Rep!A6","v":0},null,"Obrączka Rodowa","PL-DE-19-1002588",null,null,1,1,{"$f":"Info!C73","v":"niebieska"}]
[null,null,null,"Barwa","niebieska",null,null,"Płeć",2,{"$f":"Info!C74","v":"niebiesko-nakr."},null,null,{"$f":"Info!B68","v":43936},"od ubr"]
[null,"Nr Klatki ",null,"Zestawienie lotów",null,null,null,null,3,{"$f":"Info!C75","v":"ciemno-nakrap."},null,null,{"$f":"Info!B69","v":44104},"do ubr"]
[null,"Lp.","Data lotu","Miejscowość wypuszczenia","km","Włoż. Goł.\nNa lot","Nr \nkonkursu","Ilość Hodowców",4,{"$f":"Info!C76","v":"ciemna"},null,null,{"$f":"Info!B70","v":44301},"od br"]
[null,"XX","wpisz : r-m-d","max. 15 znaków","min. 100 -5%","min. 150","max. Kol. F/5","min. 20",5,{"$f":"Info!C77","v":"czarna"},null,null,{"$f":"Info!B71","v":44469},"do br"]
[null,"1.","2020-06-06","WISMAR",502.13,1936,146,53,6,{"$f":"Info!C78","v":"czerwono-nakr."},null,{"$f":"IF(AND(C6>=$M$2,C6<=$M$3,E6>=95,E6<=2000,F6>=150,H6>=20),E6,0)","v":502.13},{"$f":"IF(AND(C6>=$M$4,C6<=$M$5,E6>=95,E6<=2000,F6>=150,H6>=20),E6,0)","v":0}]
[null,"2.","2021-05-09","ZŁOCIENIEC",196.4,3624,459,67,7,{"$f":"Info!C79","v":"czerwona"},null,{"$f":"IF(AND(C7>=$M$2,C7<=$M$3,E7>=95,E7<=2000,F7>=150,H7>=20),E7,0)","v":0},{"$f":"IF(AND(C7>=$M$4,C7<=$M$5,E7>=95,E7<=2000,F7>=150,H7>=20),E7,0)","v":196.4}]
[null,"3.","2021-05-15","PASEWALK 1",330.29,3320,262,66,8,{"$f":"Info!C80","v":"płowa"},null,0,330.29]
[null,"4.","2021-05-30","PASEWALK 2",330.29,2950,313,65,9,{"$f":"Info!C81","v":"biała"},null,0,330.29]
[null,"5.","2021-06-05","LUNEBURG",566.63,2262,49,59,10,{"$f":"Info!C82","v":"szpakowata"},null,0,566.63]
[null,"6.","2021-06-19","PASEWALK 5",330.29,2343,278,60,11,{"$f":"Info!C83","v":"niebiesko-pstra"},null,0,330.29]
[{"$f":"Ex!A12","v":"MIĘDZYNARODOWE CENTRUM"},"7.","2021-07-24","SOGEL 2",770.1,965,48,44,12,{"$f":"Info!C84","v":"nieb-nakr-pstra"},null,0,770.1]
[{"$f":"Ex!A13","v":"KONGRESOWE w Katowicach"},"8.",null,null,null,null,null,null,13,{"$f":"Info!C85","v":"ciem-nakr-pstra"},null,0,0]
[{"$f":"Ex!A14","v":"07-09 stycznia 2022 roku"},"9.",null,null,null,null,null,null,14,{"$f":"Info!C86","v":"ciemno-pstra"},null,0,0]
["Imię i NAZWISKO Hodowcy","10.",null,null,null,null,null,null,15,{"$f":"Info!C87","v":"czarno-pstra"},null,0,0]
[null,"11.",null,null,null,null,null,null,16,{"$f":"Info!C88","v":"czer-nakr-pstra"},null,0,0]
["Marcin ŻEBROWSKI","12.",null,null,null,null,null,null,17,{"$f":"Info!C89","v":"czerwono-pstra"},null,0,0]
[null,"13.",null,null,null,null,null,null,18,{"$f":"Info!C90","v":"płowo-pstra"},null,0,0]
[" Oddział PZHGP","14.",null,null,null,null,null,null,19,{"$f":"Info!C91","v":"szpak-pstra"},null,0,0]
[null,"15.",null,null,null,null,null,null,20,{"$f":"Info!C92","v":"czerwono-szpak"},null,0,0]
["GRUDZIĄDZ","16.",null,null,null,null,null,null,21,{"$f":"Info!C93","v":"czer-szp-pstra"},null,0,0]
[null,"17.",null,null,null,null,null,null,22,{"$f":"Info!C94","v":"płowo-szpak"},null,0,0]
[" Okręg PZHGP","18.",null,null,null,null,null,null,23,{"$f":"Info!C95","v":"pł-szpak-pstra"},null,0,0]
[{"$f":"Info!H1","v":"TORUŃ"},"19.",null,null,null,null,null,null,null,null,null,0,0]
[null,"20.",null,null,null,null,null,null,null,null,null,0,0]
["Kategoria wystawowa",{"$f":"Ex!B26","v":"Kkm za 2020 rok "},null,null,{"$f":"SUM(L6:L25)","v":502.13},"Razem kkm :"]
["STANDARD - Samczyki (1/0)",{"$f":"Ex!B27","v":"Kkm za 2021 rok "},null,null,{"$f":"IF(OR(SUM(M6:M25)>750,SUM(M6:M25)=0),SUM(M6:M25),\"MAŁO\")","v":2524},{"$f":"IF(AND(E27<>\"MAŁO\",OR(SUM(L6:M25)>=2500,SUM(L6:M25)=0)),SUM(L6:M25),\"MAŁO\")","v":3026.1299999999997},null,"kkm"]

{"sheet":"ST-1-3","index":4,"n_rows":27,"n_cols":14,"rows_kept":27,"cut":false,"hidden":false,"merged":[[25,5,25,7],[26,1,26,3],[26,5,26,6],[14,0,15,0],[16,0,17,0],[18,0,19,0],[20,0,21,0],[23,0,24,0],[25,1,25,3],[0,0,3,0],[0,1,1,2],[0,4,0,6],[1,4,1,6],[2,1,2,2],[2,3,2,7]]}
[{"$f":"Ex!A1","v":"70. OGÓLNOPOLSKA\nWYSTAWA\nGOŁĘBI POCZTOWYCH"},{"$f":"Rep!A7","v":0},null,"Obrączka Rodowa","PL-0323-18-10022",null,null,1,1,{"$f":"Info!C73","v":"niebieska"}]
[null,null,null,"Barwa","niebieska",null,null,"Płeć",2,{"$f":"Info!C74","v":"niebiesko-nakr."},null,null,{"$f":"Info!B68","v":43936},"od ubr"]
[null,"Nr Klatki ",null,"Zestawienie lotów",null,null,null,null,3,{"$f":"Info!C75","v":"ciemno-nakrap."},null,null,{"$f":"Info!B69","v":44104},"do ubr"]
[null,"Lp.","Data lotu","Miejscowość wypuszczenia","km","Włoż. Goł.\nNa lot","Nr \nkonkursu","Ilość Hodowców",4,{"$f":"Info!C76","v":"ciemna"},null,null,{"$f":"Info!B70","v":44301},"od br"]
[null,"XX","wpisz : r-m-d","max. 15 znaków","min. 100 -5%","min. 150","max. Kol. F/5","min. 20",5,{"$f":"Info!C77","v":"czarna"},null,null,{"$f":"Info!B71","v":44469},"do br"]
[null,"1.","2021-04-25","ZŁOTÓW",142.84,3286,309,66,6,{"$f":"Info!C78","v":"czerwono-nakr."},null,{"$f":"IF(AND(C6>=$M$2,C6<=$M$3,E6>=95,E6<=2000,F6>=150,H6>=20),E6,0)","v":0},{"$f":"IF(AND(C6>=$M$4,C6<=$M$5,E6>=95,E6<=2000,F6>=150,H6>=20),E6,0)","v":142.84}]
[null,"2.","2021-05-01","SZCZECINEK",168.31,3534,74,65,7,{"$f":"Info!C79","v":"czerwona"},null,{"$f":"IF(AND(C7>=$M$2,C7<=$M$3,E7>=95,E7<=2000,F7>=150,H7>=20),E7,0)","v":0},{"$f":"IF(AND(C7>=$M$4,C7<=$M$5,E7>=95,E7<=2000,F7>=150,H7>=20),E7,0)","v":168.31}]
[null,"3.","2021-05-15","PASEWAKL 1",343,3320,336,66,8,{"$f":"Info!C80","v":"płowa"},null,0,343]
[null,"4.","2021-05-30","PASEWAKL 3",343,2950,140,65,9,{"$f":"Info!C81","v":"biała"},null,0,343]
[null,"5.","2021-06-05","LUNEBURG",579.54,2262,159,59,10,{"$f":"Info!C82","v":"szpakowata"},null,0,579.54]
[null,"6.","2021-06-19","PASEWAKL 5",343,2343,29,60,11,{"$f":"Info!C83","v":"niebiesko-pstra"},null,0,343]
[{"$f":"Ex!A12","v":"MIĘDZYNARODOWE CENTRUM"},"7.","2021-06-26","WISMAR",514.03,1866,169,52,12,{"$f":"Info!C84","v":"nieb-nakr-pstra"},null,0,514.03]
[{"$f":"Ex!A13","v":"KONGRESOWE w Katowicach"},"8.","2021-07-03","PASEWAKL 6",343,2001,125,55,13,{"$f":"Info!C85","v":"ciem-nakr-pstra"},null,0,343]
[{"$f":"Ex!A14","v":"07-09 stycznia 2022 roku"},"9.","2021-07-10","SOGEL 1",783.24,1251,93,49,14,{"$f":"Info!C86","v":"ciemno-pstra"},null,0,783.24]
["Imię i NAZWISKO Hodowcy","10.",null,null,null,null,null,null,15,{"$f":"Info!C87","v":"czarno-pstra"},null,0,0]
[null,"11.",null,null,null,null,null,null,16,{"$f":"Info!C88","v":"czer-nakr-pstra"},null,0,0]
["Jerzy KORCZAK","12.",null,null,null,null,null,null,17,{"$f":"Info!C89","v":"czerwono-pstra"},null,0,0]
[null,"13.",null,null,null,null,null,null,18,{"$f":"Info!C90","v":"płowo-pstra"},null,0,0]
[" Oddział PZHGP","14.",null,null,null,null,null,null,19,{"$f":"Info!C91","v":"szpak-pstra"},null,0,0]
[null,"15.",null,null,null,null,null,null,20,{"$f":"Info!C92","v":"czerwono-szpak"},null,0,0]
["GRUDZIĄDZ","16.",null,null,null,null,null,null,21,{"$f":"Info!C93","v":"czer-szp-pstra"},null,0,0]
[null,"17.",null,null,null,null,null,null,22,{"$f":"Info!C94","v":"płowo-szpak"},null,0,0]
[" Okręg PZHGP","18.",null,null,null,null,null,null,23,{"$f":"Info!C95","v":"pł-szpak-pstra"},null,0,0]
[{"$f":"Info!H1","v":"TORUŃ"},"19.",null,null,null,null,null,null,null,null,null,0,0]
[null,"20.",null,null,null,null,null,null,null,null,null,0,0]
["Kategoria wystawowa",{"$f":"Ex!B26","v":"Kkm za 2020 rok "},null,null,{"$f":"SUM(L6:L25)","v":0},"Razem kkm :"]
["STANDARD - Samczyki (1/0)",{"$f":"Ex!B27","v":"Kkm za 2021 rok "},null,null,{"$f":"IF(OR(SUM(M6:M25)>750,SUM(M6:M25)=0),SUM(M6:M25),\"MAŁO\")","v":3559.96},{"$f":"IF(AND(E27<>\"MAŁO\",OR(SUM(L6:M25)>=2500,SUM(L6:M25)=0)),SUM(L6:M25),\"MAŁO\")","v":3559.96},null,"kkm"]

{"sheet":"ST-1-4","index":5,"n_rows":27,"n_cols":14,"rows_kept":27,"cut":false,"hidden":false,"merged":[[25,5,25,7],[26,1,26,3],[26,5,26,6],[14,0,15,0],[16,0,17,0],[18,0,19,0],[20,0,21,0],[23,0,24,0],[25,1,25,3],[0,0,3,0],[0,1,1,2],[0,4,0,6],[1,4,1,6],[2,1,2,2],[2,3,2,7]]}
[{"$f":"Ex!A1","v":"70. OGÓLNOPOLSKA\nWYSTAWA\nGOŁĘBI POCZTOWYCH"},{"$f":"Rep!A8","v":0},null,"Obrączka Rodowa","PL-0241-19-573",null,null,1,1,{"$f":"Info!C73","v":"niebieska"}]
[null,null,null,"Barwa","niebieska",null,null,"Płeć",2,{"$f":"Info!C74","v":"niebiesko-nakr."},null,null,{"$f":"Info!B68","v":43936},"od ubr"]
[null,"Nr Klatki ",null,"Zestawienie lotów",null,null,null,null,3,{"$f":"Info!C75","v":"ciemno-nakrap."},null,null,{"$f":"Info!B69","v":44104},"do ubr"]
[null,"Lp.","Data lotu","Miejscowość wypuszczenia","km","Włoż. Goł.\nNa lot","Nr \nkonkursu","Ilość Hodowców",4,{"$f":"Info!C76","v":"ciemna"},null,null,{"$f":"Info!B70","v":44301},"od br"]
[null,"XX","wpisz : r-m-d","max. 15 znaków","min. 100 -5%","min. 150","max. Kol. F/5","min. 20",5,{"$f":"Info!C77","v":"czarna"},null,null,{"$f":"Info!B71","v":44469},"do br"]
[null,"1.","2020-05-17","SĘPULNO KRAJEŃSKIE",149.84,4017,141,64,6,{"$f":"Info!C78","v":"czerwono-nakr."},null,{"$f":"IF(AND(C6>=$M$2,C6<=$M$3,E6>=95,E6<=2000,F6>=150,H6>=20),E6,0)","v":149.84},{"$f":"IF(AND(C6>=$M$4,C6<=$M$5,E6>=95,E6<=2000,F6>=150,H6>=20),E6,0)","v":0}]
[null,"2.","2021-05-24","MIROSŁAWIEC",245.86,3805,34,66,7,{"$f":"Info!C79","v":"czerwona"},null,{"$f":"IF(AND(C7>=$M$2,C7<=$M$3,E7>=95,E7<=2000,F7>=150,H7>=20),E7,0)","v":0},{"$f":"IF(AND(C7>=$M$4,C7<=$M$5,E7>=95,E7<=2000,F7>=150,H7>=20),E7,0)","v":245.86}]
[null,"3.","2020-06-07","SZCZECIN DĄBIE",343.19,2587,96,58,8,{"$f":"Info!C80","v":"płowa"},null,343.19,0]
[null,"4.","2021-05-23","SĘPULNO KRAJEŃSKIE",149.84,4235,680,61,9,{"$f":"Info!C81","v":"biała"},null,0,149.84]
[null,"5.","2021-05-30","ZŁOTÓW",182.14,4247,46,66,10,{"$f":"Info!C82","v":"szpakowata"},null,0,182.14]
[null,"6.","2021-06-13","MYŚLIBÓRZ",331.85,3451,125,60,11,{"$f":"Info!C83","v":"niebiesko-pstra"},null,0,331.85]
[{"$f":"Ex!A12","v":"MIĘDZYNARODOWE CENTRUM"},"7.","2021-06-26","WISMAR",554.76,2361,146,52,12,{"$f":"Info!C84","v":"nieb-nakr-pstra"},null,0,554.76]
[{"$f":"Ex!A13","v":"KONGRESOWE w Katowicach"},"8.","2021-07-03","WISMAR",554.76,2332,113,50,13,{"$f":"Info!C85","v":"ciem-nakr-pstra"},null,0,554.76]
[{"$f":"Ex!A14","v":"07-09 stycznia 2022 roku"},"9.","2021-07-17","WISMAR",554.76,1664,5,43,14,{"$f":"Info!C86","v":"ciemno-pstra"},null,0,554.76]
["Imię i NAZWISKO Hodowcy","10.",null,null,null,null,null,null,15,{"$f":"Info!C87","v":"czarno-pstra"},null,0,0]
[null,"11.",null,null,null,null,null,null,16,{"$f":"Info!C88","v":"czer-nakr-pstra"},null,0,0]
["W. & A. DŁUGOKĘCKI","12.",null,null,null,null,null,null,17,{"$f":"Info!C89","v":"czerwono-pstra"},null,0,0]
[null,"13.",null,null,null,null,null,null,18,{"$f":"Info!C90","v":"płowo-pstra"},null,0,0]
[" Oddział PZHGP","14.",null,null,null,null,null,null,19,{"$f":"Info!C91","v":"szpak-pstra"},null,0,0]
[null,"15.",null,null,null,null,null,null,20,{"$f":"Info!C92","v":"czerwono-szpak"},null,0,0]
["IŁAWA","16.",null,null,null,null,null,null,21,{"$f":"Info!C93","v":"czer-szp-pstra"},null,0,0]
[null,"17.",null,null,null,null,null,null,22,{"$f":"Info!C94","v":"płowo-szpak"},null,0,0]
[" Okręg PZHGP","18.",null,null,null,null,null,null,23,{"$f":"Info!C95","v":"pł-szpak-pstra"},null,0,0]
[{"$f":"Info!H1","v":"TORUŃ"},"19.",null,null,null,null,null,null,null,null,null,0,0]
[null,"20.",null,null,null,null,null,null,null,null,null,0,0]
["Kategoria wystawowa",{"$f":"Ex!B26","v":"Kkm za 2020 rok "},null,null,{"$f":"SUM(L6:L25)","v":493.03},"Razem kkm :"]
["STANDARD - Samczyki (1/0)",{"$f":"Ex!B27","v":"Kkm za 2021 rok "},null,null,{"$f":"IF(OR(SUM(M6:M25)>750,SUM(M6:M25)=0),SUM(M6:M25),\"MAŁO\")","v":2573.9700000000003},{"$f":"IF(AND(E27<>\"MAŁO\",OR(SUM(L6:M25)>=2500,SUM(L6:M25)=0)),SUM(L6:M25),\"MAŁO\")","v":3067},null,"kkm"]

{"sheet":"ST-1-5","index":6,"n_rows":27,"n_cols":14,"rows_kept":27,"cut":false,"hidden":false,"merged":[[25,5,25,7],[26,1,26,3],[26,5,26,6],[14,0,15,0],[16,0,17,0],[18,0,19,0],[20,0,21,0],[23,0,24,0],[25,1,25,3],[0,0,3,0],[0,1,1,2],[0,4,0,6],[1,4,1,6],[2,1,2,2],[2,3,2,7]]}
[{"$f":"Ex!A1","v":"70. OGÓLNOPOLSKA\nWYSTAWA\nGOŁĘBI POCZTOWYCH"},{"$f":"Rep!A9","v":0},null,"Obrączka Rodowa","PL-0321-19-9169",null,null,1,1,{"$f":"Info!C73","v":"niebieska"}]
[null,null,null,"Barwa","nieb-nakr-pstra",null,null,"Płeć",2,{"$f":"Info!C74","v":"niebiesko-nakr."},null,null,{"$f":"Info!B68","v":43936},"od ubr"]
[null,"Nr Klatki ",null,"Zestawienie lotów",null,null,null,null,3,{"$f":"Info!C75","v":"ciemno-nakrap."},null,null,{"$f":"Info!B69","v":44104},"do ubr"]
[null,"Lp.","Data lotu","Miejscowość wypuszczenia","km","Włoż. Goł.\nNa lot","Nr \nkonkursu","Ilość Hodowców",4,{"$f":"Info!C76","v":"ciemna"},null,null,{"$f":"Info!B70","v":44301},"od br"]
[null,"XX","wpisz : r-m-d","max. 15 znaków","min. 100 -5%","min. 150","max. Kol. F/5","min. 20",5,{"$f":"Info!C77","v":"czarna"},null,null,{"$f":"Info!B71","v":44469},"do br"]
[null,"1.","2021-05-30","ZŁOTÓW",122.87,4998,48,76,6,{"$f":"Info!C78","v":"czerwono-nakr."},null,{"$f":"IF(AND(C6>=$M$2,C6<=$M$3,E6>=95,E6<=2000,F6>=150,H6>=20),E6,0)","v":0},{"$f":"IF(AND(C6>=$M$4,C6<=$M$5,E6>=95,E6<=2000,F6>=150,H6>=20),E6,0)","v":122.87}]
[null,"2.","2021-06-03","KALISZ POMORSKI",196.26,4771,256,74,7,{"$f":"Info!C79","v":"czerwona"},null,{"$f":"IF(AND(C7>=$M$2,C7<=$M$3,E7>=95,E7<=2000,F7>=150,H7>=20),E7,0)","v":0},{"$f":"IF(AND(C7>=$M$4,C7<=$M$5,E7>=95,E7<=2000,F7>=150,H7>=20),E7,0)","v":196.26}]
[null,"3.","2021-06-06","MILMERSDORF 1",348.55,4388,352,73,8,{"$f":"Info!C80","v":"płowa"},null,0,348.55]
[null,"4.","2021-06-20","MILMERSDORF 3",348.55,2484,294,65,9,{"$f":"Info!C81","v":"biała"},null,0,348.55]
[null,"5.","2021-06-27","UELZEN 1",554.79,1917,1,61,10,{"$f":"Info!C82","v":"szpakowata"},null,0,554.79]
[null,"6.","2021-07-04","UELZEN 2",554.79,1637,55,62,11,{"$f":"Info!C83","v":"niebiesko-pstra"},null,0,554.79]
[{"$f":"Ex!A12","v":"MIĘDZYNARODOWE CENTRUM"},"7.","2021-07-18","UELZEN 3",554.79,1274,159,54,12,{"$f":"Info!C84","v":"nieb-nakr-pstra"},null,0,554.79]
[{"$f":"Ex!A13","v":"KONGRESOWE w Katowicach"},"8.",null,null,null,null,null,null,13,{"$f":"Info!C85","v":"ciem-nakr-pstra"},null,0,0]
[{"$f":"Ex!A14","v":"07-09 stycznia 2022 roku"},"9.",null,null,null,null,null,null,14,{"$f":"Info!C86","v":"ciemno-pstra"},null,0,0]
["Imię i NAZWISKO Hodowcy","10.",null,null,null,null,null,null,15,{"$f":"Info!C87","v":"czarno-pstra"},null,0,0]
[null,"11.",null,null,null,null,null,null,16,{"$f":"Info!C88","v":"czer-nakr-pstra"},null,0,0]
["Zbigniew BUGAJSKI","12.",null,null,null,null,null,null,17,{"$f":"Info!C89","v":"czerwono-pstra"},null,0,0]
[null,"13.",null,null,null,null,null,null,18,{"$f":"Info!C90","v":"płowo-pstra"},null,0,0]
[" Oddział PZHGP","14.",null,null,null,null,null,null,19,{"$f":"Info!C91","v":"szpak-pstra"},null,0,0]
[null,"15.",null,null,null,null,null,null,20,{"$f":"Info!C92","v":"czerwono-szpak"},null,0,0]
["CHEŁMŻA","16.",null,null,null,null,null,null,21,{"$f":"Info!C93","v":"czer-szp-pstra"},null,0,0]
[null,"17.",null,null,null,null,null,null,22,{"$f":"Info!C94","v":"płowo-szpak"},null,0,0]
[" Okręg PZHGP","18.",null,null,null,null,null,null,23,{"$f":"Info!C95","v":"pł-szpak-pstra"},null,0,0]
[{"$f":"Info!H1","v":"TORUŃ"},"19.",null,null,null,null,null,null,null,null,null,0,0]
[null,"20.",null,null,null,null,null,null,null,null,null,0,0]
["Kategoria wystawowa",{"$f":"Ex!B26","v":"Kkm za 2020 rok "},null,null,{"$f":"SUM(L6:L25)","v":0},"Razem kkm :"]
["STANDARD - Samczyki (1/0)",{"$f":"Ex!B27","v":"Kkm za 2021 rok "},null,null,{"$f":"IF(OR(SUM(M6:M25)>750,SUM(M6:M25)=0),SUM(M6:M25),\"MAŁO\")","v":2680.6},{"$f":"IF(AND(E27<>\"MAŁO\",OR(SUM(L6:M25)>=2500,SUM(L6:M25)=0)),SUM(L6:M25),\"MAŁO\")","v":2680.6},null,"kkm"]

{"sheet":"ST-0-1","index":7,"n_rows":27,"n_cols":14,"rows_kept":27,"cut":false,"hidden":false,"merged":[[14,0,15,0],[2,3,2,7],[2,1,2,2],[0,1,1,2],[0,4,0,6],[1,4,1,6],[0,0,3,0],[25,5,25,7],[26,5,26,6],[25,1,25,3],[18,0,19,0],[16,0,17,0],[20,0,21,0],[23,0,24,0],[26,1,26,3]]}
[{"$f":"Ex!A1","v":"70. OGÓLNOPOLSKA\nWYSTAWA\nGOŁĘBI POCZTOWYCH"},{"$f":"Rep!A11","v":0},null,"Obrączka Rodowa","PL-0241-18-166",null,null,0,1,{"$f":"Info!C73","v":"niebieska"}]
[null,null,null,"Barwa","niebieska",null,null,"Płeć",2,{"$f":"Info!C74","v":"niebiesko-nakr."},null,null,{"$f":"Info!B68","v":43936},"od ubr"]
[null,"Nr Klatki ",null,"Zestawienie lotów",null,null,null,null,3,{"$f":"Info!C75","v":"ciemno-nakrap."},null,null,{"$f":"Info!B69","v":44104},"do ubr"]
[null,"Lp.","Data lotu","Miejscowość wypuszczenia","km","Włoż. Goł.\nNa lot","Nr \nkonkursu","Ilość Hodowców",4,{"$f":"Info!C76","v":"ciemna"},null,null,{"$f":"Info!B70","v":44301},"od br"]
[null,"XX","wpisz : r-m-d","max. 15 znaków","min. 100 -5%","min. 150","max. Kol. F/5","min. 20",5,{"$f":"Info!C77","v":"czarna"},null,null,{"$f":"Info!B71","v":44469},"do br"]
[null,"1.","2021-05-23","SĘPULNO KRAJEŃSKIE",149.84,4235,731,61,6,{"$f":"Info!C78","v":"czerwono-nakr."},null,{"$f":"IF(AND(C6>=$M$2,C6<=$M$3,E6>=95,E6<=2000,F6>=150,H6>=20),E6,0)","v":0},{"$f":"IF(AND(C6>=$M$4,C6<=$M$5,E6>=95,E6<=2000,F6>=150,H6>=20),E6,0)","v":149.84}]
[null,"2.","2021-05-30","ZŁOTÓW",182.14,4247,761,66,7,{"$f":"Info!C79","v":"czerwona"},null,{"$f":"IF(AND(C7>=$M$2,C7<=$M$3,E7>=95,E7<=2000,F7>=150,H7>=20),E7,0)","v":0},{"$f":"IF(AND(C7>=$M$4,C7<=$M$5,E7>=95,E7<=2000,F7>=150,H7>=20),E7,0)","v":182.14}]
[null,"3.","2021-06-20","MYŚLIBÓRZ",331.85,2932,219,53,8,{"$f":"Info!C80","v":"płowa"},null,0,331.85]
[null,"4.","2021-07-03","WISMAR",554.76,2332,73,50,9,{"$f":"Info!C81","v":"biała"},null,0,554.76]
[null,"5.","2021-07-17","WISMAR",554.76,1664,149,43,10,{"$f":"Info!C82","v":"szpakowata"},null,0,554.76]
[null,"6.","2021-07-24","SOGEL",822.36,880,82,36,11,{"$f":"Info!C83","v":"niebiesko-pstra"},null,0,822.36]
[{"$f":"Ex!A12","v":"MIĘDZYNARODOWE CENTRUM"},"7.",null,null,null,null,null,null,12,{"$f":"Info!C84","v":"nieb-nakr-pstra"},null,0,0]
[{"$f":"Ex!A13","v":"KONGRESOWE w Katowicach"},"8.",null,null,null,null,null,null,13,{"$f":"Info!C85","v":"ciem-nakr-pstra"},null,0,0]
[{"$f":"Ex!A14","v":"07-09 stycznia 2022 roku"},"9.",null,null,null,null,null,null,14,{"$f":"Info!C86","v":"ciemno-pstra"},null,0,0]
["Imię i NAZWISKO Hodowcy","10.",null,null,null,null,null,null,15,{"$f":"Info!C87","v":"czarno-pstra"},null,0,0]
[null,"11.",null,null,null,null,null,null,16,{"$f":"Info!C88","v":"czer-nakr-pstra"},null,0,0]
["W. & A. DŁUGOKĘCKI","12.",null,null,null,null,null,null,17,{"$f":"Info!C89","v":"czerwono-pstra"},null,0,0]
[null,"13.",null,null,null,null,null,null,18,{"$f":"Info!C90","v":"płowo-pstra"},null,0,0]
[" Oddział PZHGP","14.",null,null,null,null,null,null,19,{"$f":"Info!C91","v":"szpak-pstra"},null,0,0]
[null,"15.",null,null,null,null,null,null,20,{"$f":"Info!C92","v":"czerwono-szpak"},null,0,0]
["IŁAWA","16.",null,null,null,null,null,null,21,{"$f":"Info!C93","v":"czer-szp-pstra"},null,0,0]
[null,"17.",null,null,null,null,null,null,22,{"$f":"Info!C94","v":"płowo-szpak"},null,0,0]
[" Okręg PZHGP","18.",null,null,null,null,null,null,23,{"$f":"Info!C95","v":"pł-szpak-pstra"},null,0,0]
[{"$f":"Info!H1","v":"TORUŃ"},"19.",null,null,null,null,null,null,null,null,null,0,0]
[null,"20.",null,null,null,null,null,null,null,null,null,0,0]
["Kategoria wystawowa",{"$f":"Ex!B26","v":"Kkm za 2020 rok "},null,null,{"$f":"SUM(L6:L25)","v":0},"Razem kkm :"]
["STANDARD - Samiczki (0/1)",{"$f":"Ex!B27","v":"Kkm za 2021 rok "},null,null,{"$f":"IF(OR(SUM(M6:M25)>600,SUM(M6:M25)=0),SUM(M6:M25),\"MAŁO\")","v":2595.71},{"$f":"IF(AND(E27<>\"MAŁO\",OR(SUM(L6:M25)>=2000,SUM(L6:M25)=0)),SUM(L6:M25),\"MAŁO\")","v":2595.71},null,"kkm"]

{"sheet":"ST-0-2","index":8,"n_rows":27,"n_cols":14,"rows_kept":27,"cut":false,"hidden":false,"merged":[[25,5,25,7],[26,1,26,3],[26,5,26,6],[14,0,15,0],[16,0,17,0],[18,0,19,0],[20,0,21,0],[23,0,24,0],[25,1,25,3],[0,0,3,0],[0,1,1,2],[0,4,0,6],[1,4,1,6],[2,1,2,2],[2,3,2,7]]}
[{"$f":"Ex!A1","v":"70. OGÓLNOPOLSKA\nWYSTAWA\nGOŁĘBI POCZTOWYCH"},{"$f":"Rep!A12","v":0},null,"Obrączka Rodowa","PL-0323-19-49",null,null,0,1,{"$f":"Info!C73","v":"niebieska"}]
[null,null,null,"Barwa","niebiesko-nakr.",null,null,"Płeć",2,{"$f":"Info!C74","v":"niebiesko-nakr."},null,null,{"$f":"Info!B68","v":43936},"od ubr"]
[null,"Nr Klatki ",null,"Zestawienie lotów",null,null,null,null,3,{"$f":"Info!C75","v":"ciemno-nakrap."},null,null,{"$f":"Info!B69","v":44104},"do ubr"]
[null,"Lp.","Data lotu","Miejscowość wypuszczenia","km","Włoż. Goł.\nNa lot","Nr \nkonkursu","Ilość Hodowców",4,{"$f":"Info!C76","v":"ciemna"},null,null,{"$f":"Info!B70","v":44301},"od br"]
[null,"XX","wpisz : r-m-d","max. 15 znaków","min. 100 -5%","min. 150","max. Kol. F/5","min. 20",5,{"$f":"Info!C77","v":"czarna"},null,null,{"$f":"Info!B71","v":44469},"do br"]
[null,"1.","2021-04-25","ZŁOTÓW",129.31,3286,506,66,6,{"$f":"Info!C78","v":"czerwono-nakr."},null,{"$f":"IF(AND(C6>=$M$2,C6<=$M$3,E6>=95,E6<=2000,F6>=150,H6>=20),E6,0)","v":0},{"$f":"IF(AND(C6>=$M$4,C6<=$M$5,E6>=95,E6<=2000,F6>=150,H6>=20),E6,0)","v":129.31}]
[null,"2.","2021-05-01","SZCZECINEK",156.88,3534,44,65,7,{"$f":"Info!C79","v":"czerwona"},null,{"$f":"IF(AND(C7>=$M$2,C7<=$M$3,E7>=95,E7<=2000,F7>=150,H7>=20),E7,0)","v":0},{"$f":"IF(AND(C7>=$M$4,C7<=$M$5,E7>=95,E7<=2000,F7>=150,H7>=20),E7,0)","v":156.88}]
[null,"3.","2021-05-15","PASEWALK 1",330.29,3320,586,66,8,{"$f":"Info!C80","v":"płowa"},null,0,330.29]
[null,"4.","2021-05-23","PASEWALK 2",330.29,3126,282,68,9,{"$f":"Info!C81","v":"biała"},null,0,330.29]
[null,"5.","2021-05-30","PASEWALK 3",330.29,2950,321,65,10,{"$f":"Info!C82","v":"szpakowata"},null,0,330.29]
[null,"6.","2021-06-05","LUNEBURG",566.63,2262,276,59,11,{"$f":"Info!C83","v":"niebiesko-pstra"},null,0,566.63]
[{"$f":"Ex!A12","v":"MIĘDZYNARODOWE CENTRUM"},"7.","2021-06-14","PASEWALK 4",330.29,2345,429,60,12,{"$f":"Info!C84","v":"nieb-nakr-pstra"},null,0,330.29]
[{"$f":"Ex!A13","v":"KONGRESOWE w Katowicach"},"8.","2021-06-19","PASEWALK 5",330.29,2343,317,60,13,{"$f":"Info!C85","v":"ciem-nakr-pstra"},null,0,330.29]
[{"$f":"Ex!A14","v":"07-09 stycznia 2022 roku"},"9.","2021-07-03","PASEWALK 6",330.29,2001,90,55,14,{"$f":"Info!C86","v":"ciemno-pstra"},null,0,330.29]
["Imię i NAZWISKO Hodowcy","10.","2021-07-24","SOGEL 2",770.1,965,48,44,15,{"$f":"Info!C87","v":"czarno-pstra"},null,0,770.1]
[null,"11.",null,null,null,null,null,null,16,{"$f":"Info!C88","v":"czer-nakr-pstra"},null,0,0]
["Marcin ŻEBROWSKI","12.",null,null,null,null,null,null,17,{"$f":"Info!C89","v":"czerwono-pstra"},null,0,0]
[null,"13.",null,null,null,null,null,null,18,{"$f":"Info!C90","v":"płowo-pstra"},null,0,0]
[" Oddział PZHGP","14.",null,null,null,null,null,null,19,{"$f":"Info!C91","v":"szpak-pstra"},null,0,0]
[null,"15.",null,null,null,null,null,null,20,{"$f":"Info!C92","v":"czerwono-szpak"},null,0,0]
["GRUDZIĄDZ","16.",null,null,null,null,null,null,21,{"$f":"Info!C93","v":"czer-szp-pstra"},null,0,0]
[null,"17.",null,null,null,null,null,null,22,{"$f":"Info!C94","v":"płowo-szpak"},null,0,0]
[" Okręg PZHGP","18.",null,null,null,null,null,null,23,{"$f":"Info!C95","v":"pł-szpak-pstra"},null,0,0]
[{"$f":"Info!H1","v":"TORUŃ"},"19.",null,null,null,null,null,null,null,null,null,0,0]
[null,"20.",null,null,null,null,null,null,null,null,null,0,0]
["Kategoria wystawowa",{"$f":"Ex!B26","v":"Kkm za 2020 rok "},null,null,{"$f":"SUM(L6:L25)","v":0},"Razem kkm :"]
["STANDARD - Samiczki (0/1)",{"$f":"Ex!B27","v":"Kkm za 2021 rok "},null,null,{"$f":"IF(OR(SUM(M6:M25)>600,SUM(M6:M25)=0),SUM(M6:M25),\"MAŁO\")","v":3604.66},{"$f":"IF(AND(E27<>\"MAŁO\",OR(SUM(L6:M25)>=2000,SUM(L6:M25)=0)),SUM(L6:M25),\"MAŁO\")","v":3604.66},null,"kkm"]

{"sheet":"ST-0-3","index":9,"n_rows":27,"n_cols":14,"rows_kept":27,"cut":false,"hidden":false,"merged":[[25,5,25,7],[26,1,26,3],[26,5,26,6],[14,0,15,0],[16,0,17,0],[18,0,19,0],[20,0,21,0],[23,0,24,0],[25,1,25,3],[0,0,3,0],[0,1,1,2],[0,4,0,6],[1,4,1,6],[2,1,2,2],[2,3,2,7]]}
[{"$f":"Ex!A1","v":"70. OGÓLNOPOLSKA\nWYSTAWA\nGOŁĘBI POCZTOWYCH"},{"$f":"Rep!A13","v":0},null,"Obrączka Rodowa","PL-0326-19-8107",null,null,0,1,{"$f":"Info!C73","v":"niebieska"}]
[null,null,null,"Barwa","niebiesko-nakr.",null,null,"Płeć",2,{"$f":"Info!C74","v":"niebiesko-nakr."},null,null,{"$f":"Info!B68","v":43936},"od ubr"]
[null,"Nr Klatki ",null,"Zestawienie lotów",null,null,null,null,3,{"$f":"Info!C75","v":"ciemno-nakrap."},null,null,{"$f":"Info!B69","v":44104},"do ubr"]
[null,"Lp.","Data lotu","Miejscowość wypuszczenia","km","Włoż. Goł.\nNa lot","Nr \nkonkursu","Ilość Hodowców",4,{"$f":"Info!C76","v":"ciemna"},null,null,{"$f":"Info!B70","v":44301},"od br"]
[null,"XX","wpisz : r-m-d","max. 15 znaków","min. 100 -5%","min. 150","max. Kol. F/5","min. 20",5,{"$f":"Info!C77","v":"czarna"},null,null,{"$f":"Info!B71","v":44469},"do br"]
[null,"1.","2021-05-30","KALISZ POMORSKI",196.49,7499,570,144,6,{"$f":"Info!C78","v":"czerwono-nakr."},null,{"$f":"IF(AND(C6>=$M$2,C6<=$M$3,E6>=95,E6<=2000,F6>=150,H6>=20),E6,0)","v":0},{"$f":"IF(AND(C6>=$M$4,C6<=$M$5,E6>=95,E6<=2000,F6>=150,H6>=20),E6,0)","v":196.49}]
[null,"2.","2021-06-06","PASEWALK 2",325.29000000000002,6970,561,141,7,{"$f":"Info!C79","v":"czerwona"},null,{"$f":"IF(AND(C7>=$M$2,C7<=$M$3,E7>=95,E7<=2000,F7>=150,H7>=20),E7,0)","v":0},{"$f":"IF(AND(C7>=$M$4,C7<=$M$5,E7>=95,E7<=2000,F7>=150,H7>=20),E7,0)","v":325.29000000000002}]
[null,"3.","2021-07-04","UELZEN 2",553.58000000000004,3434,97,111,8,{"$f":"Info!C80","v":"płowa"},null,0,553.58000000000004]
[null,"4.","2021-07-18","UELZEN 3",553.58000000000004,2391,9,84,9,{"$f":"Info!C81","v":"biała"},null,0,553.58000000000004]
[null,"5.","2021-07-24","SOGEL 2",759.84,1517,197,68,10,{"$f":"Info!C82","v":"szpakowata"},null,0,759.84]
[null,"6.",null,null,null,null,null,null,11,{"$f":"Info!C83","v":"niebiesko-pstra"},null,0,0]
[{"$f":"Ex!A12","v":"MIĘDZYNARODOWE CENTRUM"},"7.",null,null,null,null,null,null,12,{"$f":"Info!C84","v":"nieb-nakr-pstra"},null,0,0]
[{"$f":"Ex!A13","v":"KONGRESOWE w Katowicach"},"8.",null,null,null,null,null,null,13,{"$f":"Info!C85","v":"ciem-nakr-pstra"},null,0,0]
[{"$f":"Ex!A14","v":"07-09 stycznia 2022 roku"},"9.",null,null,null,null,null,null,14,{"$f":"Info!C86","v":"ciemno-pstra"},null,0,0]
["Imię i NAZWISKO Hodowcy","10.",null,null,null,null,null,null,15,{"$f":"Info!C87","v":"czarno-pstra"},null,0,0]
[null,"11.",null,null,null,null,null,null,16,{"$f":"Info!C88","v":"czer-nakr-pstra"},null,0,0]
["Maciej KACZMAREK","12.",null,null,null,null,null,null,17,{"$f":"Info!C89","v":"czerwono-pstra"},null,0,0]
[null,"13.",null,null,null,null,null,null,18,{"$f":"Info!C90","v":"płowo-pstra"},null,0,0]
[" Oddział PZHGP","14.",null,null,null,null,null,null,19,{"$f":"Info!C91","v":"szpak-pstra"},null,0,0]
[null,"15.",null,null,null,null,null,null,20,{"$f":"Info!C92","v":"czerwono-szpak"},null,0,0]
["TORUŃ","16.",null,null,null,null,null,null,21,{"$f":"Info!C93","v":"czer-szp-pstra"},null,0,0]
[null,"17.",null,null,null,null,null,null,22,{"$f":"Info!C94","v":"płowo-szpak"},null,0,0]
[" Okręg PZHGP","18.",null,null,null,null,null,null,23,{"$f":"Info!C95","v":"pł-szpak-pstra"},null,0,0]
[{"$f":"Info!H1","v":"TORUŃ"},"19.",null,null,null,null,null,null,null,null,null,0,0]
[null,"20.",null,null,null,null,null,null,null,null,null,0,0]
["Kategoria wystawowa",{"$f":"Ex!B26","v":"Kkm za 2020 rok "},null,null,{"$f":"SUM(L6:L25)","v":0},"Razem kkm :"]
["STANDARD - Samiczki (0/1)",{"$f":"Ex!B27","v":"Kkm za 2021 rok "},null,null,{"$f":"IF(OR(SUM(M6:M25)>600,SUM(M6:M25)=0),SUM(M6:M25),\"MAŁO\")","v":2388.7800000000002},{"$f":"IF(AND(E27<>\"MAŁO\",OR(SUM(L6:M25)>=2000,SUM(L6:M25)=0)),SUM(L6:M25),\"MAŁO\")","v":2388.7800000000002},null,"kkm"]

{"sheet":"ST-0-4","index":10,"n_rows":27,"n_cols":14,"rows_kept":27,"cut":false,"hidden":false,"merged":[[25,5,25,7],[26,1,26,3],[26,5,26,6],[14,0,15,0],[16,0,17,0],[18,0,19,0],[20,0,21,0],[23,0,24,0],[25,1,25,3],[0,0,3,0],[0,1,1,2],[0,4,0,6],[1,4,1,6],[2,1,2,2],[2,3,2,7]]}
[{"$f":"Ex!A1","v":"70. OGÓLNOPOLSKA\nWYSTAWA\nGOŁĘBI POCZTOWYCH"},{"$f":"Rep!A14","v":0},null,"Obrączka Rodowa","PL-0326-20-14735",null,null,0,1,{"$f":"Info!C73","v":"niebieska"}]
[null,null,null,"Barwa","niebiesko-pstra",null,null,"Płeć",2,{"$f":"Info!C74","v":"niebiesko-nakr."},null,null,{"$f":"Info!B68","v":43936},"od ubr"]
[null,"Nr Klatki ",null,"Zestawienie lotów",null,null,null,null,3,{"$f":"Info!C75","v":"ciemno-nakrap."},null,null,{"$f":"Info!B69","v":44104},"do ubr"]
[null,"Lp.","Data lotu","Miejscowość wypuszczenia","km","Włoż. Goł.\nNa lot","Nr \nkonkursu","Ilość Hodowców",4,{"$f":"Info!C76","v":"ciemna"},null,null,{"$f":"Info!B70","v":44301},"od br"]
[null,"XX","wpisz : r-m-d","max. 15 znaków","min. 100 -5%","min. 150","max. Kol. F/5","min. 20",5,{"$f":"Info!C77","v":"czarna"},null,null,{"$f":"Info!B71","v":44469},"do br"]
[null,"1.","2021-05-24","WAŁCZ",164.57,7473,1147,133,6,{"$f":"Info!C78","v":"czerwono-nakr."},null,{"$f":"IF(AND(C6>=$M$2,C6<=$M$3,E6>=95,E6<=2000,F6>=150,H6>=20),E6,0)","v":0},{"$f":"IF(AND(C6>=$M$4,C6<=$M$5,E6>=95,E6<=2000,F6>=150,H6>=20),E6,0)","v":164.57}]
[null,"2.","2021-05-30","KALISZ POMORSKI",201.37,7499,65,144,7,{"$f":"Info!C79","v":"czerwona"},null,{"$f":"IF(AND(C7>=$M$2,C7<=$M$3,E7>=95,E7<=2000,F7>=150,H7>=20),E7,0)","v":0},{"$f":"IF(AND(C7>=$M$4,C7<=$M$5,E7>=95,E7<=2000,F7>=150,H7>=20),E7,0)","v":201.37}]
[null,"3.","2021-06-06","PASWALK 1",330.03,6970,214,141,8,{"$f":"Info!C80","v":"płowa"},null,0,330.03]
[null,"4.","2021-06-14","PASWALK 2",330.03,6017,273,141,9,{"$f":"Info!C81","v":"biała"},null,0,330.03]
[null,"5.","2021-06-20","NEUBRANDENBURG",380.74,4993,31,128,10,{"$f":"Info!C82","v":"szpakowata"},null,0,380.74]
[null,"6.","2021-06-27","UELZEN 1",559.04999999999995,4277,6,128,11,{"$f":"Info!C83","v":"niebiesko-pstra"},null,0,559.04999999999995]
[{"$f":"Ex!A12","v":"MIĘDZYNARODOWE CENTRUM"},"7.","2021-07-04","UELZEN 2",559.04999999999995,3434,93,111,12,{"$f":"Info!C84","v":"nieb-nakr-pstra"},null,0,559.04999999999995]
[{"$f":"Ex!A13","v":"KONGRESOWE w Katowicach"},"8.","2021-07-18","UELZEN 3",559.04999999999995,2391,85,84,13,{"$f":"Info!C85","v":"ciem-nakr-pstra"},null,0,559.04999999999995]
[{"$f":"Ex!A14","v":"07-09 stycznia 2022 roku"},"9.",null,null,null,null,null,null,14,{"$f":"Info!C86","v":"ciemno-pstra"},null,0,0]
["Imię i NAZWISKO Hodowcy","10.",null,null,null,null,null,null,15,{"$f":"Info!C87","v":"czarno-pstra"},null,0,0]
[null,"11.",null,null,null,null,null,null,16,{"$f":"Info!C88","v":"czer-nakr-pstra"},null,0,0]
["Tomasz RUMIŃSKI","12.",null,null,null,null,null,null,17,{"$f":"Info!C89","v":"czerwono-pstra"},null,0,0]
[null,"13.",null,null,null,null,null,null,18,{"$f":"Info!C90","v":"płowo-pstra"},null,0,0]
[" Oddział PZHGP","14.",null,null,null,null,null,null,19,{"$f":"Info!C91","v":"szpak-pstra"},null,0,0]
[null,"15.",null,null,null,null,null,null,20,{"$f":"Info!C92","v":"czerwono-szpak"},null,0,0]
["TORUŃ","16.",null,null,null,null,null,null,21,{"$f":"Info!C93","v":"czer-szp-pstra"},null,0,0]
[null,"17.",null,null,null,null,null,null,22,{"$f":"Info!C94","v":"płowo-szpak"},null,0,0]
[" Okręg PZHGP","18.",null,null,null,null,null,null,23,{"$f":"Info!C95","v":"pł-szpak-pstra"},null,0,0]
[{"$f":"Info!H1","v":"TORUŃ"},"19.",null,null,null,null,null,null,null,null,null,0,0]
[null,"20.",null,null,null,null,null,null,null,null,null,0,0]
["Kategoria wystawowa",{"$f":"Ex!B26","v":"Kkm za 2020 rok "},null,null,{"$f":"SUM(L6:L25)","v":0},"Razem kkm :"]
["STANDARD - Samiczki (0/1)",{"$f":"Ex!B27","v":"Kkm za 2021 rok "},null,null,{"$f":"IF(OR(SUM(M6:M25)>600,SUM(M6:M25)=0),SUM(M6:M25),\"MAŁO\")","v":3083.8900000000003},{"$f":"IF(AND(E27<>\"MAŁO\",OR(SUM(L6:M25)>=2000,SUM(L6:M25)=0)),SUM(L6:M25),\"MAŁO\")","v":3083.8900000000003},null,"kkm"]

{"sheet":"ST-0-5","index":11,"n_rows":27,"n_cols":14,"rows_kept":27,"cut":false,"hidden":false,"merged":[[25,5,25,7],[26,1,26,3],[26,5,26,6],[14,0,15,0],[16,0,17,0],[18,0,19,0],[20,0,21,0],[23,0,24,0],[25,1,25,3],[0,0,3,0],[0,1,1,2],[0,4,0,6],[1,4,1,6],[2,1,2,2],[2,3,2,7]]}
[{"$f":"Ex!A1","v":"70. OGÓLNOPOLSKA\nWYSTAWA\nGOŁĘBI POCZTOWYCH"},{"$f":"Rep!A15","v":0},null,"Obrączka Rodowa","PL-0326-19-6673",null,null,0,1,{"$f":"Info!C73","v":"niebieska"}]
[null,null,null,"Barwa","niebiesko-nakr.",null,null,"Płeć",2,{"$f":"Info!C74","v":"niebiesko-nakr."},null,null,{"$f":"Info!B68","v":43936},"od ubr"]
[null,"Nr Klatki ",null,"Zestawienie lotów",null,null,null,null,3,{"$f":"Info!C75","v":"ciemno-nakrap."},null,null,{"$f":"Info!B69","v":44104},"do ubr"]
[null,"Lp.","Data lotu","Miejscowość wypuszczenia","km","Włoż. Goł.\nNa lot","Nr \nkonkursu","Ilość Hodowców",4,{"$f":"Info!C76","v":"ciemna"},null,null,{"$f":"Info!B70","v":44301},"od br"]
[null,"XX","wpisz : r-m-d","max. 15 znaków","min. 100 -5%","min. 150","max. Kol. F/5","min. 20",5,{"$f":"Info!C77","v":"czarna"},null,null,{"$f":"Info!B71","v":44469},"do br"]
[null,"1.","2021-05-30","KALISZ POMORSKI",196.49,7499,170,133,6,{"$f":"Info!C78","v":"czerwono-nakr."},null,{"$f":"IF(AND(C6>=$M$2,C6<=$M$3,E6>=95,E6<=2000,F6>=150,H6>=20),E6,0)","v":0},{"$f":"IF(AND(C6>=$M$4,C6<=$M$5,E6>=95,E6<=2000,F6>=150,H6>=20),E6,0)","v":196.49}]
[null,"2.","2021-06-06","PASEWALK 1",325.29000000000002,6970,370,141,7,{"$f":"Info!C79","v":"czerwona"},null,{"$f":"IF(AND(C7>=$M$2,C7<=$M$3,E7>=95,E7<=2000,F7>=150,H7>=20),E7,0)","v":0},{"$f":"IF(AND(C7>=$M$4,C7<=$M$5,E7>=95,E7<=2000,F7>=150,H7>=20),E7,0)","v":325.29000000000002}]
[null,"3.","2021-06-14","PASEWALK 2",325.29000000000002,6017,58,141,8,{"$f":"Info!C80","v":"płowa"},null,0,325.29000000000002]
[null,"4.","2021-06-20","NEUBRANDENURG",375.97,4993,123,128,9,{"$f":"Info!C81","v":"biała"},null,0,375.97]
[null,"5.","2021-07-04","UELZEN 2",553.58000000000004,3434,66,111,10,{"$f":"Info!C82","v":"szpakowata"},null,0,553.58000000000004]
[null,"6.","2021-07-18","UELZEN 3",553.58000000000004,2391,313,84,11,{"$f":"Info!C83","v":"niebiesko-pstra"},null,0,553.58000000000004]
[{"$f":"Ex!A12","v":"MIĘDZYNARODOWE CENTRUM"},"7.","2021-07-24","SOGEL 2",759.84,1517,289,68,12,{"$f":"Info!C84","v":"nieb-nakr-pstra"},null,0,759.84]
[{"$f":"Ex!A13","v":"KONGRESOWE w Katowicach"},"8.",null,null,null,null,null,null,13,{"$f":"Info!C85","v":"ciem-nakr-pstra"},null,0,0]
[{"$f":"Ex!A14","v":"07-09 stycznia 2022 roku"},"9.",null,null,null,null,null,null,14,{"$f":"Info!C86","v":"ciemno-pstra"},null,0,0]
["Imię i NAZWISKO Hodowcy","10.",null,null,null,null,null,null,15,{"$f":"Info!C87","v":"czarno-pstra"},null,0,0]
[null,"11.",null,null,null,null,null,null,16,{"$f":"Info!C88","v":"czer-nakr-pstra"},null,0,0]
["Maciej KACZMAREK","12.",null,null,null,null,null,null,17,{"$f":"Info!C89","v":"czerwono-pstra"},null,0,0]
[null,"13.",null,null,null,null,null,null,18,{"$f":"Info!C90","v":"płowo-pstra"},null,0,0]
[" Oddział PZHGP","14.",null,null,null,null,null,null,19,{"$f":"Info!C91","v":"szpak-pstra"},null,0,0]
[null,"15.",null,null,null,null,null,null,20,{"$f":"Info!C92","v":"czerwono-szpak"},null,0,0]
["TORUŃ","16.",null,null,null,null,null,null,21,{"$f":"Info!C93","v":"czer-szp-pstra"},null,0,0]
[null,"17.",null,null,null,null,null,null,22,{"$f":"Info!C94","v":"płowo-szpak"},null,0,0]
[" Okręg PZHGP","18.",null,null,null,null,null,null,23,{"$f":"Info!C95","v":"pł-szpak-pstra"},null,0,0]
[{"$f":"Info!H1","v":"TORUŃ"},"19.",null,null,null,null,null,null,null,null,null,0,0]
[null,"20.",null,null,null,null,null,null,null,null,null,0,0]
["Kategoria wystawowa",{"$f":"Ex!B26","v":"Kkm za 2020 rok "},null,null,{"$f":"SUM(L6:L25)","v":0},"Razem kkm :"]
["STANDARD - Samiczki (0/1)",{"$f":"Ex!B27","v":"Kkm za 2021 rok "},null,null,{"$f":"IF(OR(SUM(M6:M25)>600,SUM(M6:M25)=0),SUM(M6:M25),\"MAŁO\")","v":3090.04},{"$f":"IF(AND(E27<>\"MAŁO\",OR(SUM(L6:M25)>=2000,SUM(L6:M25)=0)),SUM(L6:M25),\"MAŁO\")","v":3090.04},null,"kkm"]

{"sheet":"STM-1-1","index":12,"n_rows":27,"n_cols":14,"rows_kept":27,"cut":false,"hidden":false,"merged":[[26,1,26,3],[25,5,25,7],[26,5,26,6],[25,1,25,3],[18,0,19,0],[20,0,21,0],[23,0,24,0],[14,0,15,0],[2,3,2,7],[2,1,2,2],[1,4,1,6],[0,1,1,2],[0,4,0,6],[0,0,3,0],[16,0,17,0]]}
[{"$f":"Ex!A1","v":"70. OGÓLNOPOLSKA\nWYSTAWA\nGOŁĘBI POCZTOWYCH"},{"$f":"Rep!A17","v":0},null,"Obrączka Rodowa","PL-0241-21-5145",null,null,1,1,{"$f":"Info!C73","v":"niebieska"}]
[null,null,null,"Barwa","niebiesko-pstra",null,null,"Płeć",2,{"$f":"Info!C74","v":"niebiesko-nakr."},null,null,{"$f":"Info!B68","v":43936},"od ubr"]
[null,"Nr Klatki ",null,"Zestawienie lotów",null,null,null,null,3,{"$f":"Info!C75","v":"ciemno-nakrap."},null,null,{"$f":"Info!B69","v":44104},"do ubr"]
[null,"Lp.","Data lotu","Miejscowość wypuszczenia","km","Włoż. Goł.\nNa lot","Nr \nkonkursu","Ilość Hodowców",4,{"$f":"Info!C76","v":"ciemna"},null,null,{"$f":"Info!B70","v":44301},"od br"]
[null,"XX","wpisz : r-m-d","max. 15 znaków","min. 100 -5%","min. 250","max. Kol. F/5","min. 20",5,{"$f":"Info!C77","v":"czarna"},null,null,{"$f":"Info!B71","v":44469},"do br"]
[null,"1.","2021-09-05","WĄGROWIEC",172.75,1946,301,45,6,{"$f":"Info!C78","v":"czerwono-nakr."},null,{"$f":"IF(AND(E6>=95,F6>=250,H6>=20),1,0)","v":1}]
[null,"2.","2021-09-11","SZAMOTUŁY",215.93,1600,7,43,7,{"$f":"Info!C79","v":"czerwona"},null,{"$f":"IF(AND(E7>=95,F7>=250,H7>=20),1,0)","v":1}]
[null,"3.","2021-09-19","PNIEWY",240.08,998,62,26,8,{"$f":"Info!C80","v":"płowa"},null,1]
[null,null,null,null,null,null,null,null,9,{"$f":"Info!C81","v":"biała"},null,0]
[null,null,null,null,null,null,null,null,10,{"$f":"Info!C82","v":"szpakowata"},null,0]
[null,null,null,null,null,null,null,null,11,{"$f":"Info!C83","v":"niebiesko-pstra"},null,0]
[{"$f":"Ex!A12","v":"MIĘDZYNARODOWE CENTRUM"},null,null,null,null,null,null,null,12,{"$f":"Info!C84","v":"nieb-nakr-pstra"},null,0]
[{"$f":"Ex!A13","v":"KONGRESOWE w Katowicach"},null,null,null,null,null,null,null,13,{"$f":"Info!C85","v":"ciem-nakr-pstra"},null,{"$f":"SUM(L6:L12)","v":3}]
[{"$f":"Ex!A14","v":"07-09 stycznia 2022 roku"},null,null,null,null,null,null,null,14,{"$f":"Info!C86","v":"ciemno-pstra"}]
["Imię i NAZWISKO Hodowcy",null,null,null,null,null,null,null,15,{"$f":"Info!C87","v":"czarno-pstra"}]
[null,null,null,null,null,null,null,null,16,{"$f":"Info!C88","v":"czer-nakr-pstra"}]
["BILICKI - GÓRA",null,null,null,null,null,null,null,17,{"$f":"Info!C89","v":"czerwono-pstra"}]
[null,null,null,null,null,null,null,null,18,{"$f":"Info!C90","v":"płowo-pstra"}]
[" Oddział PZHGP",null,null,null,null,null,null,null,19,{"$f":"Info!C91","v":"szpak-pstra"}]
[null,null,null,null,null,null,null,null,20,{"$f":"Info!C92","v":"czerwono-szpak"}]
["IŁAWA",null,null,null,null,null,null,null,21,{"$f":"Info!C93","v":"czer-szp-pstra"}]
[null,null,null,null,null,null,null,null,22,{"$f":"Info!C94","v":"płowo-szpak"}]
[" Okręg PZHGP",null,null,null,null,null,null,null,23,{"$f":"Info!C95","v":"pł-szpak-pstra"}]
[{"$f":"Info!H1","v":"TORUŃ"}]
[]
["Kategoria wystawowa",null,null,null,null,"Razem kkm :"]
["STANDARD MŁODE - 1/0",null,null,null,null,{"$f":"IF(L13=0,0,IF(AND(SUM(E6:E12)>=300,L13>=3),SUM(E6:E12),\"MAŁO\"))","v":628.76},null,"kkm"]

{"sheet":"STM-1-2","index":13,"n_rows":27,"n_cols":14,"rows_kept":27,"cut":false,"hidden":false,"merged":[[25,5,25,7],[26,1,26,3],[26,5,26,6],[14,0,15,0],[16,0,17,0],[18,0,19,0],[20,0,21,0],[23,0,24,0],[25,1,25,3],[0,0,3,0],[0,1,1,2],[0,4,0,6],[1,4,1,6],[2,1,2,2],[2,3,2,7]]}
[{"$f":"Ex!A1","v":"70. OGÓLNOPOLSKA\nWYSTAWA\nGOŁĘBI POCZTOWYCH"},{"$f":"Rep!A18","v":0},null,"Obrączka Rodowa","PL-0241-21-5207",null,null,1,1,{"$f":"Info!C73","v":"niebieska"}]
[null,null,null,"Barwa","niebieska",null,null,"Płeć",2,{"$f":"Info!C74","v":"niebiesko-nakr."},null,null,{"$f":"Info!B68","v":43936},"od ubr"]
[null,"Nr Klatki ",null,"Zestawienie lotów",null,null,null,null,3,{"$f":"Info!C75","v":"ciemno-nakrap."},null,null,{"$f":"Info!B69","v":44104},"do ubr"]
[null,"Lp.","Data lotu","Miejscowość wypuszczenia","km","Włoż. Goł.\nNa lot","Nr \nkonkursu","Ilość Hodowców",4,{"$f":"Info!C76","v":"ciemna"},null,null,{"$f":"Info!B70","v":44301},"od br"]
[null,"XX","wpisz : r-m-d","max. 15 znaków","min. 100 -5%","min. 250","max. Kol. F/5","min. 20",5,{"$f":"Info!C77","v":"czarna"},null,null,{"$f":"Info!B71","v":44469},"do br"]
[null,"1.","2021-08-22","SZUBIN",126.54,3133,236,55,6,{"$f":"Info!C78","v":"czerwono-nakr."},null,{"$f":"IF(AND(E6>=95,F6>=250,H6>=20),1,0)","v":1}]
[null,"2.","2021-09-05","WĄGROWIEC",172.75,1946,302,45,7,{"$f":"Info!C79","v":"czerwona"},null,{"$f":"IF(AND(E7>=95,F7>=250,H7>=20),1,0)","v":1}]
[null,"3.","2021-09-11","SZAMOTUŁY",215.93,1600,267,43,8,{"$f":"Info!C80","v":"płowa"},null,1]
[null,null,null,null,null,null,null,null,9,{"$f":"Info!C81","v":"biała"},null,0]
[null,null,null,null,null,null,null,null,10,{"$f":"Info!C82","v":"szpakowata"},null,0]
[null,null,null,null,null,null,null,null,11,{"$f":"Info!C83","v":"niebiesko-pstra"},null,0]
[{"$f":"Ex!A12","v":"MIĘDZYNARODOWE CENTRUM"},null,null,null,null,null,null,null,12,{"$f":"Info!C84","v":"nieb-nakr-pstra"},null,0]
[{"$f":"Ex!A13","v":"KONGRESOWE w Katowicach"},null,null,null,null,null,null,null,13,{"$f":"Info!C85","v":"ciem-nakr-pstra"},null,{"$f":"SUM(L6:L12)","v":3}]
[{"$f":"Ex!A14","v":"07-09 stycznia 2022 roku"},null,null,null,null,null,null,null,14,{"$f":"Info!C86","v":"ciemno-pstra"}]
["Imię i NAZWISKO Hodowcy",null,null,null,null,null,null,null,15,{"$f":"Info!C87","v":"czarno-pstra"}]
[null,null,null,null,null,null,null,null,16,{"$f":"Info!C88","v":"czer-nakr-pstra"}]
["BILICKI - GÓRA",null,null,null,null,null,null,null,17,{"$f":"Info!C89","v":"czerwono-pstra"}]
[null,null,null,null,null,null,null,null,18,{"$f":"Info!C90","v":"płowo-pstra"}]
[" Oddział PZHGP",null,null,null,null,null,null,null,19,{"$f":"Info!C91","v":"szpak-pstra"}]
[null,null,null,null,null,null,null,null,20,{"$f":"Info!C92","v":"czerwono-szpak"}]
["IŁAWA",null,null,null,null,null,null,null,21,{"$f":"Info!C93","v":"czer-szp-pstra"}]
[null,null,null,null,null,null,null,null,22,{"$f":"Info!C94","v":"płowo-szpak"}]
[" Okręg PZHGP",null,null,null,null,null,null,null,23,{"$f":"Info!C95","v":"pł-szpak-pstra"}]
[{"$f":"Info!H1","v":"TORUŃ"}]
[]
["Kategoria wystawowa",null,null,null,null,"Razem kkm :"]
["STANDARD MŁODE - 1/0",null,null,null,null,{"$f":"IF(L13=0,0,IF(AND(SUM(E6:E12)>=300,L13>=3),SUM(E6:E12),\"MAŁO\"))","v":515.22},null,"kkm"]

{"sheet":"STM-0-1","index":14,"n_rows":27,"n_cols":14,"rows_kept":27,"cut":false,"hidden":false,"merged":[[25,5,25,7],[26,1,26,3],[26,5,26,6],[14,0,15,0],[16,0,17,0],[18,0,19,0],[20,0,21,0],[23,0,24,0],[25,1,25,3],[0,0,3,0],[0,1,1,2],[0,4,0,6],[1,4,1,6],[2,1,2,2],[2,3,2,7]]}
[{"$f":"Ex!A1","v":"70. OGÓLNOPOLSKA\nWYSTAWA\nGOŁĘBI POCZTOWYCH"},{"$f":"Rep!A20","v":0},null,"Obrączka Rodowa","PL-0325-21-4502",null,null,0,1,{"$f":"Info!C73","v":"niebieska"}]
[null,null,null,"Barwa","niebiesko-nakr.",null,null,"Płeć",2,{"$f":"Info!C74","v":"niebiesko-nakr."},null,null,{"$f":"Info!B68","v":43936},"od ubr"]
[null,"Nr Klatki ",null,"Zestawienie lotów",null,null,null,null,3,{"$f":"Info!C75","v":"ciemno-nakrap."},null,null,{"$f":"Info!B69","v":44104},"do ubr"]
[null,"Lp.","Data lotu","Miejscowość wypuszczenia","km","Włoż. Goł.\nNa lot","Nr \nkonkursu","Ilość Hodowców",4,{"$f":"Info!C76","v":"ciemna"},null,null,{"$f":"Info!B70","v":44301},"od br"]
[null,"XX","wpisz : r-m-d","max. 15 znaków","min. 100 -5%","min. 250","max. Kol. F/5","min. 20",5,{"$f":"Info!C77","v":"czarna"},null,null,{"$f":"Info!B71","v":44469},"do br"]
[null,"1.","2021-08-28","CZAPLINEK",148.62,2112,208,49,6,{"$f":"Info!C78","v":"czerwono-nakr."},null,{"$f":"IF(AND(E6>=95,F6>=250,H6>=20),1,0)","v":1}]
[null,"2.","2021-09-12","STARGARD",228.34,1263,2,35,7,{"$f":"Info!C79","v":"czerwona"},null,{"$f":"IF(AND(E7>=95,F7>=250,H7>=20),1,0)","v":1}]
[null,"3.","2021-09-19","PASEWALK",295.12,909,180,27,8,{"$f":"Info!C80","v":"płowa"},null,1]
[null,null,null,null,null,null,null,null,9,{"$f":"Info!C81","v":"biała"},null,0]
[null,null,null,null,null,null,null,null,10,{"$f":"Info!C82","v":"szpakowata"},null,0]
[null,null,null,null,null,null,null,null,11,{"$f":"Info!C83","v":"niebiesko-pstra"},null,0]
[{"$f":"Ex!A12","v":"MIĘDZYNARODOWE CENTRUM"},null,null,null,null,null,null,null,12,{"$f":"Info!C84","v":"nieb-nakr-pstra"},null,0]
[{"$f":"Ex!A13","v":"KONGRESOWE w Katowicach"},null,null,null,null,null,null,null,13,{"$f":"Info!C85","v":"ciem-nakr-pstra"},null,{"$f":"SUM(L6:L12)","v":3}]
[{"$f":"Ex!A14","v":"07-09 stycznia 2022 roku"},null,null,null,null,null,null,null,14,{"$f":"Info!C86","v":"ciemno-pstra"}]
["Imię i NAZWISKO Hodowcy",null,null,null,null,null,null,null,15,{"$f":"Info!C87","v":"czarno-pstra"}]
[null,null,null,null,null,null,null,null,16,{"$f":"Info!C88","v":"czer-nakr-pstra"}]
["J. & Z. GRACZYK",null,null,null,null,null,null,null,17,{"$f":"Info!C89","v":"czerwono-pstra"}]
[null,null,null,null,null,null,null,null,18,{"$f":"Info!C90","v":"płowo-pstra"}]
[" Oddział PZHGP",null,null,null,null,null,null,null,19,{"$f":"Info!C91","v":"szpak-pstra"}]
[null,null,null,null,null,null,null,null,20,{"$f":"Info!C92","v":"czerwono-szpak"}]
["ŚWIECIE",null,null,null,null,null,null,null,21,{"$f":"Info!C93","v":"czer-szp-pstra"}]
[null,null,null,null,null,null,null,null,22,{"$f":"Info!C94","v":"płowo-szpak"}]
[" Okręg PZHGP",null,null,null,null,null,null,null,23,{"$f":"Info!C95","v":"pł-szpak-pstra"}]
[{"$f":"Info!H1","v":"TORUŃ"}]
[]
["Kategoria wystawowa",null,null,null,null,"Razem kkm :"]
["STANDARD MŁODE - 0/1",null,null,null,null,{"$f":"IF(L13=0,0,IF(AND(SUM(E6:E12)>=300,L13>=3),SUM(E6:E12),\"MAŁO\"))","v":672.08},null,"kkm"]

{"sheet":"STM-0-2","index":15,"n_rows":27,"n_cols":14,"rows_kept":27,"cut":false,"hidden":false,"merged":[[25,5,25,7],[26,1,26,3],[26,5,26,6],[14,0,15,0],[16,0,17,0],[18,0,19,0],[20,0,21,0],[23,0,24,0],[25,1,25,3],[0,0,3,0],[0,1,1,2],[0,4,0,6],[1,4,1,6],[2,1,2,2],[2,3,2,7]]}
[{"$f":"Ex!A1","v":"70. OGÓLNOPOLSKA\nWYSTAWA\nGOŁĘBI POCZTOWYCH"},{"$f":"Rep!A21","v":0},null,"Obrączka Rodowa","PL-0325-21-4542",null,null,0,1,{"$f":"Info!C73","v":"niebieska"}]
[null,null,null,"Barwa","niebiesko-pstra",null,null,"Płeć",2,{"$f":"Info!C74","v":"niebiesko-nakr."},null,null,{"$f":"Info!B68","v":43936},"od ubr"]
[null,"Nr Klatki ",null,"Zestawienie lotów",null,null,null,null,3,{"$f":"Info!C75","v":"ciemno-nakrap."},null,null,{"$f":"Info!B69","v":44104},"do ubr"]
[null,"Lp.","Data lotu","Miejscowość wypuszczenia","km","Włoż. Goł.\nNa lot","Nr \nkonkursu","Ilość Hodowców",4,{"$f":"Info!C76","v":"ciemna"},null,null,{"$f":"Info!B70","v":44301},"od br"]
[null,"XX","wpisz : r-m-d","max. 15 znaków","min. 100 -5%","min. 250","max. Kol. F/5","min. 20",5,{"$f":"Info!C77","v":"czarna"},null,null,{"$f":"Info!B71","v":44469},"do br"]
[null,"1.","2021-08-22","SZCZECINEK",123.88,2321,188,48,6,{"$f":"Info!C78","v":"czerwono-nakr."},null,{"$f":"IF(AND(E6>=95,F6>=250,H6>=20),1,0)","v":1}]
[null,"2.","2021-08-28","CZAPLINEK",148.62,2112,75,49,7,{"$f":"Info!C79","v":"czerwona"},null,{"$f":"IF(AND(E7>=95,F7>=250,H7>=20),1,0)","v":1}]
[null,"3.","2021-09-12","STARGARD",228.34,1263,206,35,8,{"$f":"Info!C80","v":"płowa"},null,1]
[null,null,null,null,null,null,null,null,9,{"$f":"Info!C81","v":"biała"},null,0]
[null,null,null,null,null,null,null,null,10,{"$f":"Info!C82","v":"szpakowata"},null,0]
[null,null,null,null,null,null,null,null,11,{"$f":"Info!C83","v":"niebiesko-pstra"},null,0]
[{"$f":"Ex!A12","v":"MIĘDZYNARODOWE CENTRUM"},null,null,null,null,null,null,null,12,{"$f":"Info!C84","v":"nieb-nakr-pstra"},null,0]
[{"$f":"Ex!A13","v":"KONGRESOWE w Katowicach"},null,null,null,null,null,null,null,13,{"$f":"Info!C85","v":"ciem-nakr-pstra"},null,{"$f":"SUM(L6:L12)","v":3}]
[{"$f":"Ex!A14","v":"07-09 stycznia 2022 roku"},null,null,null,null,null,null,null,14,{"$f":"Info!C86","v":"ciemno-pstra"}]
["Imię i NAZWISKO Hodowcy",null,null,null,null,null,null,null,15,{"$f":"Info!C87","v":"czarno-pstra"}]
[null,null,null,null,null,null,null,null,16,{"$f":"Info!C88","v":"czer-nakr-pstra"}]
["J. & Z. GRACZYK",null,null,null,null,null,null,null,17,{"$f":"Info!C89","v":"czerwono-pstra"}]
[null,null,null,null,null,null,null,null,18,{"$f":"Info!C90","v":"płowo-pstra"}]
[" Oddział PZHGP",null,null,null,null,null,null,null,19,{"$f":"Info!C91","v":"szpak-pstra"}]
[null,null,null,null,null,null,null,null,20,{"$f":"Info!C92","v":"czerwono-szpak"}]
["ŚWIECIE",null,null,null,null,null,null,null,21,{"$f":"Info!C93","v":"czer-szp-pstra"}]
[null,null,null,null,null,null,null,null,22,{"$f":"Info!C94","v":"płowo-szpak"}]
[" Okręg PZHGP",null,null,null,null,null,null,null,23,{"$f":"Info!C95","v":"pł-szpak-pstra"}]
[{"$f":"Info!H1","v":"TORUŃ"}]
[]
["Kategoria wystawowa",null,null,null,null,"Razem kkm :"]
["STANDARD MŁODE - 0/1",null,null,null,null,{"$f":"IF(L13=0,0,IF(AND(SUM(E6:E12)>=300,L13>=3),SUM(E6:E12),\"MAŁO\"))","v":500.84000000000003},null,"kkm"]

{"sheet":"Rep","index":16,"n_rows":21,"n_cols":6,"rows_kept":21,"cut":false,"hidden":false,"merged":[[0,0,0,1]]}
["REPREZENTACJA ",null,{"$f":"CONCATENATE(Info!G1,Info!H1)","v":"Okręgu PZHGP TORUŃ"}]
[]
["Klatka","Imię i Nazwisko Hodowcy","Obrączka Rodowa Gołębia","Barwa Gołębia","Pł.","kkm"]
[null,"STANDARD - SAMCZYKI (1/0)",null,"R A Z E M  : ",null,{"$f":"SUM(F5:F9)","v":14882.22}]
[null,{"$f":"IF('ST-1-1'!$A$17=\"\",\"\",'ST-1-1'!$A$17)","v":"Maciej KACZMAREK"},{"$f":"IF('ST-1-1'!$E$1=\"\",\"\",'ST-1-1'!$E$1)","v":"PL-0326-20-9441"},{"$f":"IF('ST-1-1'!$E$2=\"\",\"\",'ST-1-1'!$E$2)","v":"niebiesko-nakr."},1,{"$f":"'ST-1-1'!$F$27","v":2548.5300000000002}]
[null,{"$f":"IF('ST-1-2'!$A$17=\"\",\"\",'ST-1-2'!$A$17)","v":"Marcin ŻEBROWSKI"},{"$f":"IF('ST-1-2'!$E$1=\"\",\"\",'ST-1-2'!$E$1)","v":"PL-DE-19-1002588"},{"$f":"IF('ST-1-2'!$E$2=\"\",\"\",'ST-1-2'!$E$2)","v":"niebieska"},1,{"$f":"'ST-1-2'!$F$27","v":3026.1299999999997}]
[null,{"$f":"IF('ST-1-3'!$A$17=\"\",\"\",'ST-1-3'!$A$17)","v":"Jerzy KORCZAK"},{"$f":"IF('ST-1-3'!$E$1=\"\",\"\",'ST-1-3'!$E$1)","v":"PL-0323-18-10022"},{"$f":"IF('ST-1-3'!$E$2=\"\",\"\",'ST-1-3'!$E$2)","v":"niebieska"},1,{"$f":"'ST-1-3'!$F$27","v":3559.96}]
[null,{"$f":"IF('ST-1-4'!$A$17=\"\",\"\",'ST-1-4'!$A$17)","v":"W. & A. DŁUGOKĘCKI"},{"$f":"IF('ST-1-4'!$E$1=\"\",\"\",'ST-1-4'!$E$1)","v":"PL-0241-19-573"},{"$f":"IF('ST-1-4'!$E$2=\"\",\"\",'ST-1-4'!$E$2)","v":"niebieska"},1,{"$f":"'ST-1-4'!$F$27","v":3067}]
[null,{"$f":"IF('ST-1-5'!$A$17=\"\",\"\",'ST-1-5'!$A$17)","v":"Zbigniew BUGAJSKI"},{"$f":"IF('ST-1-5'!$E$1=\"\",\"\",'ST-1-5'!$E$1)","v":"PL-0321-19-9169"},{"$f":"IF('ST-1-5'!$E$2=\"\",\"\",'ST-1-5'!$E$2)","v":"nieb-nakr-pstra"},1,{"$f":"'ST-1-5'!$F$27","v":2680.6}]
[null,"STANDARD - SAMICZKI (0/1)",null,"R A Z E M  : ",null,{"$f":"SUM(F11:F15)","v":14763.080000000002}]
[null,{"$f":"IF('ST-0-1'!$A$17=\"\",\"\",'ST-0-1'!$A$17)","v":"W. & A. DŁUGOKĘCKI"},{"$f":"IF('ST-0-1'!$E$1=\"\",\"\",'ST-0-1'!$E$1)","v":"PL-0241-18-166"},{"$f":"IF('ST-0-1'!$E$2=\"\",\"\",'ST-0-1'!$E$2)","v":"niebieska"},0,{"$f":"'ST-0-1'!$F$27","v":2595.71}]
[null,{"$f":"IF('ST-0-2'!$A$17=\"\",\"\",'ST-0-2'!$A$17)","v":"Marcin ŻEBROWSKI"},{"$f":"IF('ST-0-2'!$E$1=\"\",\"\",'ST-0-2'!$E$1)","v":"PL-0323-19-49"},{"$f":"IF('ST-0-2'!$E$2=\"\",\"\",'ST-0-2'!$E$2)","v":"niebiesko-nakr."},0,{"$f":"'ST-0-2'!$F$27","v":3604.66}]
[null,{"$f":"IF('ST-0-3'!$A$17=\"\",\"\",'ST-0-3'!$A$17)","v":"Maciej KACZMAREK"},{"$f":"IF('ST-0-3'!$E$1=\"\",\"\",'ST-0-3'!$E$1)","v":"PL-0326-19-8107"},{"$f":"IF('ST-0-3'!$E$2=\"\",\"\",'ST-0-3'!$E$2)","v":"niebiesko-nakr."},0,{"$f":"'ST-0-3'!$F$27","v":2388.7800000000002}]
[null,{"$f":"IF('ST-0-4'!$A$17=\"\",\"\",'ST-0-4'!$A$17)","v":"Tomasz RUMIŃSKI"},{"$f":"IF('ST-0-4'!$E$1=\"\",\"\",'ST-0-4'!$E$1)","v":"PL-0326-20-14735"},{"$f":"IF('ST-0-4'!$E$2=\"\",\"\",'ST-0-4'!$E$2)","v":"niebiesko-pstra"},0,{"$f":"'ST-0-4'!$F$27","v":3083.8900000000003}]
[null,{"$f":"IF('ST-0-5'!$A$17=\"\",\"\",'ST-0-5'!$A$17)","v":"Maciej KACZMAREK"},{"$f":"IF('ST-0-5'!$E$1=\"\",\"\",'ST-0-5'!$E$1)","v":"PL-0326-19-6673"},{"$f":"IF('ST-0-5'!$E$2=\"\",\"\",'ST-0-5'!$E$2)","v":"niebiesko-nakr."},0,{"$f":"'ST-0-5'!$F$27","v":3090.04}]
[null,"STANDARD MŁODE - SAMCZYKI (1/0)",null,"R A Z E M  : ",null,{"$f":"SUM(F17:F18)","v":1143.98}]
[null,{"$f":"IF('STM-1-1'!$A$17=\"\",\"\",'STM-1-1'!$A$17)","v":"BILICKI - GÓRA"},{"$f":"IF('STM-1-1'!$E$1=\"\",\"\",'STM-1-1'!$E$1)","v":"PL-0241-21-5145"},{"$f":"IF('STM-1-1'!$E$2=\"\",\"\",'STM-1-1'!$E$2)","v":"niebiesko-pstra"},1,{"$f":"'STM-1-1'!$F$27","v":628.76}]
[null,{"$f":"IF('STM-1-2'!$A$17=\"\",\"\",'STM-1-2'!$A$17)","v":"BILICKI - GÓRA"},{"$f":"IF('STM-1-2'!$E$1=\"\",\"\",'STM-1-2'!$E$1)","v":"PL-0241-21-5207"},{"$f":"IF('STM-1-2'!$E$2=\"\",\"\",'STM-1-2'!$E$2)","v":"niebieska"},1,{"$f":"'STM-1-2'!$F$27","v":515.22}]
[null,"STANDARD MŁODE - SAMICZKI (0/1)",null,"R A Z E M  : ",null,{"$f":"SUM(F20:F21)","v":1172.92}]
[null,{"$f":"IF('STM-0-1'!$A$17=\"\",\"\",'STM-0-1'!$A$17)","v":"J. & Z. GRACZYK"},{"$f":"IF('STM-0-1'!$E$1=\"\",\"\",'STM-0-1'!$E$1)","v":"PL-0325-21-4502"},{"$f":"IF('STM-0-1'!$E$2=\"\",\"\",'STM-0-1'!$E$2)","v":"niebiesko-nakr."},0,{"$f":"'STM-0-1'!$F$27","v":672.08}]
[null,{"$f":"IF('STM-0-2'!$A$17=\"\",\"\",'STM-0-2'!$A$17)","v":"J. & Z. GRACZYK"},{"$f":"IF('STM-0-2'!$E$1=\"\",\"\",'STM-0-2'!$E$1)","v":"PL-0325-21-4542"},{"$f":"IF('STM-0-2'!$E$2=\"\",\"\",'STM-0-2'!$E$2)","v":"niebiesko-pstra"},0,{"$f":"'STM-0-2'!$F$27","v":500.84000000000003}]